1.0 3.0
0.3735475697950965 2.192281072530344
0.007410776974627041 1.6777353254757548
-0.19397831282810132 1.3548388527356507
-0.2929148593709594 1.1564201409522823
-0.32971043138333417 1.0381751873328569
-0.33020249596528534 0.9709977852521456
-0.3107407628555011 0.9358619984104881
-0.28149078797039867 0.9204111545450891
-0.24861662889794714 0.916687255706809
-0.2157178641799893 0.9196219642782059
-0.18477151486778853 0.9260357369453773
-0.156745956347661 0.933975653057799
-0.13199812382369805 0.9422786972186132
-0.11052804755342314 0.9502848743105876
-0.09213987643842499 0.9576497000908615
-0.07654195754553811 0.9642224368459891
-0.0634074873797673 0.9699676880272886
-0.05240989950098134 0.974915474764441
-0.043242272085086714 0.9791299273007941
-0.035626805447254245 0.9826900637198395
-0.02931828333399015 0.9856783511183276
-0.02410402550188513 0.9881742215525009
-0.019801917448805894 0.9902506947694806
-0.016257502568507234 0.9919729078446098
-0.013340733499724483 0.9933977792467553
-0.010942730560007123 0.9945743155841444
-0.008972737772964912 0.9955442527413886
-0.0073553692379656945 0.9963428422276728
-0.006028179395696562 0.9969996702314213
-0.004939556249721131 0.9975394456812446
-0.00404691772944281 0.9979827242047844
-0.0033151822049523176 0.9983465536451558
-0.002715480861093716 0.998645037952086
-0.0022240797549234717 0.9988898225785285
-0.0018214813675827529 0.9990905077915893
-0.0014916783560326766 0.9992549977227125
-0.0012215354296768515 0.999389793291683
-0.0010002784825289288 0.9995002368228326
-0.0008190731180088593 0.9995907155311223
-0.0006706774208891172 0.9996648302751949
-0.0005491562273630798 0.9997255351638465
-0.0004496462212858586 0.9997752528236103
-0.0003681629623192594 0.9998159694204702
-0.00030144245884339933 0.9998493128918847
-0.0002468111670857463 0.999876617289272
-0.00020207935977923906 0.9998989756526317
-0.00016545369261108708 0.9999172834316691
-0.0001354655316983986 0.9999322741238695
-0.00011091221407127016 0.999944548511406
-9.08089162328938e-05 0.9999545986378016
