1.0 1.0
1.1799099608775627 0.7821868616276275
1.3130956839396053 0.53272445466439
1.3941488451292663 0.2615042373698179
1.4197306474405644 -0.02069428314278394
1.388709198864032 -0.30263193019932916
1.3022090986319892 -0.5730574375809072
1.1635710772701342 -0.8211564079849225
0.9782231209589817 -1.0369837369682284
0.753468045797972 -1.2118622133603354
0.4981958315789182 -1.3387313222544912
0.2225320437881527 -1.4124322318763374
-0.0625637543600204 -1.4299174641531613
-0.34573367457419785 -1.390376731287409
-0.6156739435038503 -1.2952737489887296
-0.861586089036513 -1.148292379113695
-1.0736088657396985 -0.9551940693818367
-1.2432136448704831 -0.7235921014728516
-1.3635474177430138 -0.4626514896110189
-1.4297096200047092 -0.1827263563670373
-1.4389515976426452 0.10505086894000314
-1.3907906001498425 0.3892121326168345
-1.2870335808370241 0.6584107182936167
-1.1317096739793444 0.9018742814382547
-0.9309138604829125 1.1098358704476752
-0.6925678828131816 1.273925690316826
-0.4261077842349845 1.3875078969358998
-0.14211039424454178 1.4459488721696248
0.14812645690203857 1.4468061370117764
0.4330333356212964 1.3899302053459122
0.7012303404363228 1.277475139545681
0.9419815972645971 1.113817203922767
1.1456249645966452 0.9053846781839977
1.303959751519222 0.6604054443561154
1.4105768926106848 0.38858225513243044
1.4611182888577345 0.10070849730888863
1.4534548237712384 -0.19176033582310922
1.3877757881498058 -0.47716245136555857
1.266585967637782 -0.7440947085850567
1.0946103244489132 -0.9818681799365215
0.8786098919516702 -1.1809361233416014
0.6271160511141872 -1.3332772322244117
0.3500936291367399 -1.4327187801522745
0.058546121856378974 -1.4751866446441055
-0.23592132230778237 -1.4588720865460385
-0.521563802265817 -1.3843084629830518
-0.7869650656875099 -1.2543546323461747
-1.021493733371643 -1.0740855267472147
-1.2157291165074338 -0.8505940728142833
-1.3618395736848006 -0.5927121877224654
-1.4538982142764794 -0.3106618221316094
