1.0 3.0
0.36701004007082166 2.184916977668053
-0.000842305286508277 1.6681294532831732
-0.2016538567051613 1.345502785685601
-0.2990998772814997 1.148423336482312
-0.3342060148622001 1.03182632641103
-0.3331471644467912 0.9662332268655409
-0.3124048291675985 0.9324604698673316
-0.28216995679822804 0.9181070700592617
-0.24858177258552466 0.9152261971225633
-0.21519550989875955 0.9187841649592027
-0.18394025104434905 0.9256426545189997
-0.1557403726841364 0.9338882460181888
-0.13091569172967615 0.9423921773142124
-0.10943655323733877 0.9505224614341271
-0.09108427113871778 0.9579566229325683
-0.07555017683948662 0.9645607106473892
-0.06249515014212379 0.9703118230065738
-0.05158396870423338 0.9752490822356528
-0.04250382833502005 0.9794431101856128
-0.03497309895267362 0.9829774543223719
-0.02874421884485173 0.9859376632125169
-0.023603213022373493 0.9884052001693328
-0.019367397341007238 0.9904543671180234
-0.015882230938879614 0.9921510583516077
-0.013017894129393302 0.9935525889130217
-0.010665923508963346 0.9947081201547928
-0.008736081970820094 0.9956593856247167
-0.007153546433629064 0.9964415370067443
-0.005856439271819614 0.9970840044153029
-0.004793696834549489 0.997611312456762
-0.003923251039572123 0.9980438227447773
-0.0032104919802606316 0.9983983913147244
-0.002626977030071711 0.9986889397786811
-0.002149352677873024 0.9989269448093065
-0.0017584577803843615 0.9991218534012983
-0.001438580152631734 0.9992814324701109
-0.0011768418830885904 0.9994120614362101
-0.0009626921423884124 0.9995189759680402
-0.0007874893863575867 0.9996064703027813
-0.0006441576597269778 0.9996780647031535
-0.0005269041645251164 0.9997366437415237
-0.00043098737604592305 0.9997845702847007
-0.00035252679495320437 0.9998237793112236
-0.00028834694942804593 0.9998558550379545
-0.000235849541221335 0.999882094264674
-0.0001929086979612553 0.9999035583591273
-0.00015778518241626278 0.9999211158928258
-0.00012905614563136922 0.9999354775911931
-0.00010555761944078302 0.9999472249716171
-8.633744591910842e-05 0.9999568338014915
