1.0 1.0
1.178797085961038 0.7814329946574228
1.3105482010385314 0.5316611776067341
1.390050164562191 0.26069298999043
1.4141333761425303 -0.02066856355122656
1.3818376794412601 -0.3012061133608622
1.294450641957638 -0.5697351407408959
1.1554562221812326 -0.8155498842451612
0.9703958706532863 -1.0288501588174586
0.7466476025787657 -1.2011320712782096
0.49313184995559733 -1.3255270550460743
0.21995582035467276 -1.3970757073981006
-0.06198945888792213 -1.412925511874791
-0.3414633459582769 -1.3724445629958597
-0.6073237283630849 -1.2772467592862187
-0.8489712385667991 -1.1311274602079167
-1.0567718314028947 -0.9399121722339305
-1.2224408758701877 -0.7112242966687407
-1.3393734482753594 -0.4541811986809634
-1.4029076585359155 -0.17903071471585894
-1.4105105113024914 0.10325740993109266
-1.3618788919538551 0.3814288647456225
-1.258951651333575 0.6443934627424198
-1.1058323074275689 0.8816672859306011
-0.9086254457207144 1.0837906599661042
-0.6751933406465518 1.2427052941054055
-0.414842501183451 1.3520755505788267
-0.1379526374471155 1.4075410349587307
0.1444371593005816 1.4068904372034896
0.421068524982915 1.3501496926490413
0.6809126730674346 1.239580948126381
0.9136100921110307 1.0795923744195137
1.1098835605541129 0.8765624206716665
1.2619080126186482 0.6385855173906332
1.363622509431494 0.37514936640507823
1.4109718776524278 0.0967566836271803
1.4020683819135205 -0.18549352495741336
1.3372669854815948 -0.46034846031443855
1.219151198634583 -0.7168501588553575
1.0524300789466523 -0.944772366404536
0.8437504898877609 -1.135028240273186
0.6014321026394402 -1.2800326251031207
0.33513570611552634 -1.374004459203222
0.055478049056903275 -1.4131972549884684
-0.22639143026166822 -1.3960484646846598
-0.4992351117026442 -1.3232417763575142
-0.7521752166084913 -1.1976798566331224
-0.9751274849456733 -1.024368626803128
-1.1592032163351236 -0.8102176860100881
-1.2970636463275702 -0.5637648382711592
-1.3832125295878352 -0.29483570593967573
