-1.0 3.0
-1.2926123116316002 2.59891141604704
-1.5520194005746535 2.2448503964767754
-1.7819073373638705 1.9324130807739968
-1.985536184980102 1.6568189326545875
-2.165789122320905 1.4138388560625479
-2.3252159024755423 1.1997316011865222
-2.466071299142213 1.0111875044503056
-2.590349119179207 0.8452787166876508
-2.6998122926248453 0.6994151712522895
-2.7960194925514275 0.5713056301058279
-2.880348684949452 0.4589232222663282
-2.9540179626857697 0.36047495653662404
-3.018103976749292 0.27437475017904733
-3.073558241876548 0.19921956806047866
-3.1212215616937464 0.13376831355312008
-3.1618367902416384 0.07692315384510842
-3.1960601217393907 0.027712998912966327
-3.224471078317894 -0.014721114214881478
-3.247581345878771 -0.05113895163096677
-3.265842590918607 -0.08221252154540964
-3.2796533758382176 -0.10853619407601711
-3.289365276703796 -0.13063565396915625
-3.2952882954368388 -0.14897582084349212
-3.297695647802501 -0.16396785602686254
-3.2968279991820935 -0.17597536132479627
-3.292897211813692 -0.18531986291102975
-3.2860896598404703 -0.19228566278321
-3.2765691620090203 -0.19712413071921955
-3.2644795761118552 -0.20005750125828922
-3.249947094183139 -0.20128223278982102
-3.2330822729579727 -0.20097197924976237
-3.213981830125656 -0.19928021910048435
-3.1927302333864374 -0.19634258111786665
-3.1694011062063785 -0.1922789019512256
-3.144058471409334 -0.18719504638931328
-3.116757851307168 -0.1811845176982446
-3.087547240912646 -0.17432988224124413
-3.0564679688714302 -0.16670402979810206
-3.023555459061684 -0.15837128853221194
-2.988839904316487 -0.1493884113679019
-2.9523468624031923 -0.13980544860761274
-2.9140977832251513 -0.1296665199082594
-2.874110475177275 -0.11901049722312643
-2.8323995176722145 -0.10787160897714627
-2.7889766260447346 -0.09627997455927073
-2.743850974325947 -0.08426207716806794
-2.6970294807457678 -0.07184118211991056
-2.648517060261645 -0.05903770690923402
-2.598316847915953 -0.045869548585010064
-2.546430396385917 -0.03235237336589592
