1.0 3.0
0.37347454686017767 2.1922039353675693
0.007315321145555897 1.6776331327512468
-0.19407129301772041 1.3547375989838244
-0.29299468764743575 1.1563312809084132
-0.32977396902106804 1.0381024064551578
-0.33025031275593925 0.9709408871840287
-0.31077501307022076 0.9358190738804384
-0.2815140840944332 0.9203797419242199
-0.24863148663753637 0.9166649220821339
-0.21572646480755275 0.9196065628259718
-0.1847756361668189 0.9260254907924315
-0.1567469868950676 0.9339691520262101
-0.1319971131682554 0.9422748557785146
-0.11052576702326107 0.9502828766957683
-0.09213687803790482 0.9576489456501405
-0.07653862549640691 0.9642224914880435
-0.0634040806502873 0.9699682437332706
-0.05240658555564018 0.974916317179981
-0.04323915291537481 0.9791309105336077
-0.035623937203627574 0.9826910911648296
-0.029315690854109185 0.9856793611224933
-0.024101712879204276 0.9881751768562361
-0.019799875593802127 0.9902515748320678
-0.016255714525182277 0.9919737033356029
-0.013339178111664352 0.9933984881412681
-0.010941384939630643 0.9945749404315997
-0.008971578914576794 0.9955447987834185
-0.007354375026858748 0.9963433161240893
-0.006027329197845193 0.9970000792170596
-0.0049388312155571115 0.9975397970247402
-0.004046300907209834 0.9979830248763061
-0.0033146585311712613 0.9983468101266489
-0.002715037075292654 0.9986452561429489
-0.002223704271075329 0.9988900077636864
-0.0018211641241684118 0.999090664649025
-0.0014914106591903363 0.9992551303547098
-0.0012213097986675456 0.9993899052691385
-0.0010000885031240699 0.9995003312355869
-0.0008189133069300449 0.9995907950397417
-0.0006705431027693269 0.9996648971613675
-0.0005490434246113 0.999725591377726
-0.0004495515565520851 0.9997753000272284
-0.00036808357284364573 0.9998160090268496
-0.00030137592175066494 0.9998493460998249
-0.00024675543458684696 0.9998766451139722
-0.00020203270322457015 0.9998989989524387
-0.00016541465437139302 0.9999173029312896
-0.00013543288391412028 0.9999322904344127
-0.00011088492338876335 0.9999445621476128
-9.078611373171397e-05 0.9999546100328041
