aclImdb
-train
--unsupBow.feat
--labeledBow.feat
--urls_neg.txt
--urls_pos.txt
--neg
---XXXXX_X.txt (e.g. 12262_3.txt) 
--pos
---XXXXX_X.txt (e.g. 12260_10.txt)
--urls_unsup.txt
--unsup
-test
--labeledBow.feat
--urls_neg.txt
--urls_pos.txt
--neg
---XXXXX_X.txt (e.g. 12429_1.txt)
--pos
---XXXXX_X.txt (e.g. 12173_9.txt)
-imdbEr.txt
-imdb.vocab