{
  "envs": [
    {
    "id": "DEV",
    "nom": "A1-SRV-D-EDI01",
    "adresse_ip": "192.168.2.53",
    "description": "DEV/REC"
    },
    {
    "id": "REC",
    "nom": "A1-SRV-S-EDI01",
    "adresse_ip": "192.168.2.209",
    "description": "PPROD/STA"
    },
    {
    "id": "PROD",
    "nom": "A1-SRV-P-EDI01",
    "adresse_ip": "192.168.2.166",
    "description": "PRODUCTION"
    }
  ],
  "DEV": [
    {
      "adresse_ip": "192.168.2.53",
      "port": 9100,
      "description" : "Interface de suivi"
    },
    {
      "adresse_ip": "192.168.2.53",
      "port": 3389,
      "description" : "Bureau a distance"
    },
    {
      "adresse_ip": "192.168.2.53",
      "port": 9080,
      "description" : "HC Designer"
    },
    {
      "adresse_ip": "192.168.2.53",
      "port": 9081,
      "description" : "HC eAccess (WS/API)"
    },
    {
      "adresse_ip": "10.128.3.190",
      "port": 3306,
      "description" : "Base de donnees MySQL"
    }
  ],
  "REC": [
    {
      "adresse_ip": "192.168.2.209",
      "port": 9100,
      "description" : "Interface de suivi"
    },
    {
      "adresse_ip": "192.168.2.209",
      "port": 3389,
      "description" : "Bureau a distance"
    }
  ],
  "PROD": [
    {
      "adresse_ip": "192.168.2.166",
      "port": 9100,
      "description" : "Interface de suivi"
    },
    {
      "adresse_ip": "192.168.2.166",
      "port": 3389,
      "description" : "Bureau a distance"
    },
    {
      "adresse_ip": "192.168.2.166",
      "port": 9084,
      "description" : "HC Platform (Serveur de licence)"
    }
  ]
}