<svg width="40" height="40" viewBox="0 0 40 40" fill="none" xmlns="http://www.w3.org/2000/svg">
<circle cx="20" cy="20" r="20" fill="#E31E24"/>
<circle cx="20" cy="20" r="20" fill="#E31E24"/>
<path d="M24.1073 8H15.3216C11.2787 8 8.00012 11.2785 8.00012 15.3214V24.1071C8.00012 28.15 11.2787 31.4286 15.3216 31.4286H24.1073C28.1502 31.4286 31.4287 28.15 31.4287 24.1071V15.3214C31.4287 11.2785 28.1502 8 24.1073 8ZM29.2323 24.1071C29.2323 26.9332 26.9333 29.2321 24.1073 29.2321H15.3216C12.4955 29.2321 10.1966 26.9332 10.1966 24.1071V15.3214C10.1966 12.4954 12.4955 10.1964 15.3216 10.1964H24.1073C26.9333 10.1964 29.2323 12.4954 29.2323 15.3214V24.1071Z" fill="white"/>
<path d="M19.7143 13.8572C16.4797 13.8572 13.8571 16.4797 13.8571 19.7143C13.8571 22.9489 16.4797 25.5715 19.7143 25.5715C22.9489 25.5715 25.5714 22.9489 25.5714 19.7143C25.5714 16.4797 22.9489 13.8572 19.7143 13.8572ZM19.7143 23.375C17.6965 23.375 16.0535 21.7321 16.0535 19.7143C16.0535 17.6951 17.6965 16.0536 19.7143 16.0536C21.732 16.0536 23.375 17.6951 23.375 19.7143C23.375 21.7321 21.732 23.375 19.7143 23.375Z" fill="white"/>
<path d="M26.011 14.1983C26.4421 14.1983 26.7916 13.8488 26.7916 13.4178C26.7916 12.9868 26.4421 12.6373 26.011 12.6373C25.58 12.6373 25.2305 12.9868 25.2305 13.4178C25.2305 13.8488 25.58 14.1983 26.011 14.1983Z" fill="white"/>
</svg>
