{
    "easy_vpn": {
        "directory": "/opt/vpn/easy",
        "container_dirpath": "/tmp",
        "regex_location": [
            "(.*)-(.*)\\."
        ],
        "files_auth": {
            "auth_01.txt": {
                "max_connections": 5,
                "used_connections": 0
            },
            "auth_02.txt": {
                "max_connections": 5,
                "used_connections": 0
            },
            "auth_03.txt": {
                "max_connections": 5,
                "used_connections": 0
            },
            "auth_04.txt": {
                "max_connections": 5,
                "used_connections": 0
            },
            "auth_05.txt": {
                "max_connections": 5,
                "used_connections": 0
            },
            "auth_06.txt": {
                "max_connections": 5,
                "used_connections": 0
            },
            "auth_07.txt": {
                "max_connections": 5,
                "used_connections": 0
            }
        }
    },
    "express_vpn": {
        "directory": "/opt/vpn/express",
        "container_dirpath": "/tmp",
        "regex_location": [
            "my_expressvpn_(\\w+)_"
        ],
        "files_auth": {
            "auth_01.txt": {
                "max_connections": 5,
                "used_connections": 0
            },
            "auth_02.txt": {
                "max_connections": 5,
                "used_connections": 0
            },
            "auth_03.txt": {
                "max_connections": 5,
                "used_connections": 0
            },
            "auth_04.txt": {
                "max_connections": 5,
                "used_connections": 0
            }
        }
    },
    "nordvpn": {
        "directory": "/opt/vpn/nordvpn",
        "container_dirpath": "/tmp",
        "regex_location": [
            "(^[A-Za-z]{2})"
        ],
        "files_auth": {
            "auth_01.txt": {
                "max_connections": 6,
                "used_connections": 0
            },
            "auth_02.txt": {
                "max_connections": 6,
                "used_connections": 0
            }
        }
    },
    "surfshark": {
        "directory": "/opt/vpn/surfshark",
        "container_dirpath": "/tmp",
        "regex_location": [
            "(^[a-z]{2})-([a-z]{3})"
        ],
        "files_auth": {
            "auth_01.txt": {
                "max_connections": 20,
                "used_connections": 0
            }
        }
    }
}
