@startuml
class RadialSlider {
    + currentValue : float = 50.0f
    + minValue : float = 0
    + maxValue : float = 100
    + decimals : int
    + isPercent : bool
    + rememberValue : bool
    + sliderTag : string
    + SliderAngle : float <<get>> <<set>>
    + SliderValue : float <<get>> <<set>>
    + SliderValueRaw : float <<get>> <<set>>
    + OnPointerDown(eventData:PointerEventData) : void
    + OnPointerUp(eventData:PointerEventData) : void
    + OnDrag(eventData:PointerEventData) : void
    + OnPointerEnter(eventData:PointerEventData) : void
    + OnPointerExit(eventData:PointerEventData) : void
    + LoadState() : void
    + SaveState() : void
    + UpdateUI() : void
}
class SliderEvent {
}
class "UnityEvent`1"<T> {
}
MonoBehaviour <|-- RadialSlider
IPointerDownHandler <|-- RadialSlider
IPointerUpHandler <|-- RadialSlider
IDragHandler <|-- RadialSlider
IPointerEnterHandler <|-- RadialSlider
IPointerExitHandler <|-- RadialSlider
RadialSlider --> "sliderImage" Image
RadialSlider --> "indicatorPivot" Transform
RadialSlider --> "valueText" TextMeshProUGUI
RadialSlider --> "onPointerEnter" UnityEvent
RadialSlider --> "onPointerExit" UnityEvent
RadialSlider +-- SliderEvent
"UnityEvent`1" "<float>" <|-- SliderEvent
@enduml
