@startuml
class UISettings {
    + mainMusicStarted : bool = false
    + IsEpilepsyProtectionOn() : bool
    + hideEchoSettings() : void
    + showEchoSettings() : void
    + setupSettings() : void
    + ShowSettingsButton() : void
    + loadOutputDevices() : void
    + loadInputDevices() : void
    + openSettingsBut() : void
}
MonoBehaviour <|-- UISettings
UISettings --> "connect" SocketConnect
UISettings --> "AuthUI" UIAuth
UISettings --> "uiJoinServer" UIWindow
UISettings --> "voiceManager" EOSVoiceManager
UISettings --> "eOSManager" EOSManager
UISettings --> "voiceWearManager" VoiceWearManagerLSD
UISettings --> "openSettings" Button
UISettings --> "microphones" Dropdown
UISettings --> "speakers" Dropdown
UISettings --> "VoiceSkins" Dropdown
UISettings --> "settingsWindow" GameObject
UISettings --> "EchoSettings" GameObject
UISettings --> "gameCanvas" CanvasScaler
UISettings --> "error" ErrorUI
UISettings --> "uiScaling" Slider
UISettings --> "inputGain" Slider
UISettings --> "outputGain" Slider
UISettings --> "EchoOn" Toggle
UISettings --> "LowQualAudio" Toggle
UISettings --> "audioEffectSlider" Slider
UISettings --> "musicVolumeSlider" Slider
UISettings --> "audioController" AudioController
UISettings --> "epilepsyProtectionToggle" Toggle
UISettings --> "firstTime" Button
UISettings --> "modulateManager" ModulateManager
UISettings --> "autoGain" Toggle
UISettings --> "inputVolumeGroup" CanvasGroup
UISettings --> "noiseSupression" Toggle
@enduml
