@startuml
class ScreenshotManager {
    + ScreenshotManager()
    + OnEndOfFrame() : void
    + TakeScreenshot(source:object, frameNumber:int, maximumWidth:int, maximumHeight:int, callback:Action<int, byte[]>) : void
}
class ScreenshotOperation {
    + FrameNumber : int <<get>> <<set>>
    + IsAwaiting : bool <<get>> <<set>>
    + IsComplete : bool <<get>> <<set>>
    + IsInUse : bool <<get>> <<set>>
    + MaximumHeight : int <<get>> <<set>>
    + MaximumWidth : int <<get>> <<set>>
    + Source : object <<get>> <<set>>
    + Use() : void
}
class "Action`2"<T1,T2> {
}
ScreenshotManager +-- ScreenshotOperation
ScreenshotOperation --> "Callback<int,byte[]>" "Action`2"
@enduml
