@startuml
class MultiSelectUI {
    + SendSelection() : void
}
class "List`1"<T> {
}
class Selectable {
    + backEndName : string
    + defaultValue : bool
}
MonoBehaviour <|-- MultiSelectUI
MultiSelectUI o-> "Selectables<Selectable>" "List`1"
MultiSelectUI +-- Selectable
Selectable --> "toggle" Toggle
@enduml
