@startuml
class AsyncUnityUserReportingPlatform {
    + AsyncUnityUserReportingPlatform()
    + DeserializeJson(json:string) : T
    + OnEndOfFrame(client:UserReportingClient) : void
    + Post(endpoint:string, contentType:string, content:byte[], progressCallback:Action<float, float>, callback:Action<bool, byte[]>) : void
    + ReceiveLogMessage(logString:string, stackTrace:string, logType:LogType) : void
    + RunTask(task:Func<object>, callback:Action<object>) : void
    + SendAnalyticsEvent(eventName:string, eventData:Dictionary<string, object>) : void
    + SerializeJson(instance:object) : string
    + TakeScreenshot(frameNumber:int, maximumWidth:int, maximumHeight:int, source:object, callback:Action<int, byte[]>) : void
    + Update(client:UserReportingClient) : void
    + <<virtual>> GetDeviceMetadata() : IDictionary<string, string>
    + <<virtual>> GetSamplerNames() : Dictionary<string, string>
    + <<virtual>> ModifyUserReport(userReport:UserReport) : void
    + <<virtual>> SampleAutomaticMetrics(client:UserReportingClient) : void
}
class LogMessage <<struct>> {
    + LogString : string
    + StackTrace : string
}
class PostOperation {
}
class ProfilerSampler <<struct>> {
    + Name : string
    + GetValue() : double
}
class "Action`2"<T1,T2> {
}
IUserReportingPlatform <|-- AsyncUnityUserReportingPlatform
ILogListener <|-- AsyncUnityUserReportingPlatform
AsyncUnityUserReportingPlatform +-- LogMessage
LogMessage --> "LogType" LogType
AsyncUnityUserReportingPlatform +-- PostOperation
PostOperation --> "Callback<bool,byte[]>" "Action`2"
PostOperation --> "ProgressCallback<float,float>" "Action`2"
PostOperation --> "WebRequest" UnityWebRequest
AsyncUnityUserReportingPlatform +-- ProfilerSampler
ProfilerSampler --> "Recorder" Recorder
@enduml
