@startuml
class UIGradient {
    + ModifyVertices : bool <<get>> <<set>>
    + Offset : float <<get>> <<set>>
    + Zoom : float <<get>> <<set>>
    + <<override>> ModifyMesh(helper:VertexHelper) : void
}
enum Type {
    Horizontal,
    Vertical,
    Diamond,
}
enum Blend {
    Override,
    Add,
    Multiply,
}
BaseMeshEffect <|-- UIGradient
UIGradient --> "BlendMode" Blend
UIGradient --> "GradientType" Type
UIGradient +-- Type
UIGradient +-- Blend
@enduml
