@startuml
class ButtonManager {
    + buttonText : string = "Button"
    + fadingMultiplier : float = 8
    + useCustomContent : bool = false
    + enableButtonSounds : bool = false
    + useHoverSound : bool = true
    + useClickSound : bool = true
    + useRipple : bool = true
    + speed : float = 1f
    + maxSize : float = 4f
    + renderOnTop : bool = false
    + centered : bool = false
    + UpdateUI() : void
    + CreateRipple(pos:Vector2) : void
    + OnPointerDown(eventData:PointerEventData) : void
    + OnPointerEnter(eventData:PointerEventData) : void
    + OnPointerExit(eventData:PointerEventData) : void
}
enum AnimationSolution {
    ANIMATOR,
    SCRIPT,
}
enum RippleUpdateMode {
    NORMAL,
    UNSCALED_TIME,
}
MonoBehaviour <|-- ButtonManager
IPointerEnterHandler <|-- ButtonManager
IPointerExitHandler <|-- ButtonManager
IPointerDownHandler <|-- ButtonManager
ButtonManager --> "clickEvent" UnityEvent
ButtonManager --> "hoverEvent" UnityEvent
ButtonManager --> "hoverSound" AudioClip
ButtonManager --> "clickSound" AudioClip
ButtonManager --> "buttonVar" Button
ButtonManager --> "normalText" TextMeshProUGUI
ButtonManager --> "highlightedText" TextMeshProUGUI
ButtonManager --> "soundSource" AudioSource
ButtonManager --> "rippleParent" GameObject
ButtonManager o-> "animationSolution" AnimationSolution
ButtonManager o-> "rippleUpdateMode" RippleUpdateMode
ButtonManager --> "rippleShape" Sprite
ButtonManager o-> "startColor" Color
ButtonManager o-> "transitionColor" Color
ButtonManager +-- AnimationSolution
ButtonManager +-- RippleUpdateMode
@enduml
