@startuml
class RoomButtonHover {
    + {static} resetStaticVariables() : void
    + OnPointerEnter(eventData:PointerEventData) : void
    + OnPointerExit(eventData:PointerEventData) : void
}
MonoBehaviour <|-- RoomButtonHover
IPointerEnterHandler <|-- RoomButtonHover
IPointerExitHandler <|-- RoomButtonHover
RoomButtonHover --> "connect" SocketConnect
@enduml
