@startuml
abstract class WebSocketContext {
    + {abstract} Host : string <<get>>
    + {abstract} IsAuthenticated : bool <<get>>
    + {abstract} IsLocal : bool <<get>>
    + {abstract} IsSecureConnection : bool <<get>>
    + {abstract} IsWebSocketRequest : bool <<get>>
    + {abstract} Origin : string <<get>>
    + {abstract} SecWebSocketKey : string <<get>>
    + {abstract} SecWebSocketVersion : string <<get>>
}
class "IEnumerable`1"<T> {
}
WebSocketContext --> "CookieCollection" CookieCollection
WebSocketContext --> "Headers" NameValueCollection
WebSocketContext --> "QueryString" NameValueCollection
WebSocketContext --> "RequestUri" Uri
WebSocketContext --> "SecWebSocketProtocols<string>" "IEnumerable`1"
WebSocketContext --> "User" IPrincipal
WebSocketContext --> "WebSocket" WebSocket
@enduml
