@startuml
class AudioRecorder {
    + setPlayUnfiltered(val:bool) : void
    + GetMaxPosition(id:string) : int
    + RecordAudio(audioVoiceFilter:short[], audioNoFilter:short[], channels:int, sampleRate:int) : void
    + PlayRecording(replay:string, position:int) : void
    + StartRecording(filename:string) : void
    + StopRecording() : void
    + ClearRecordings() : void
    + StopPlaying() : void
    + PlayShortList(audio:List<(short, short)>, sample_rate:int, name:string) : IEnumerator
    + StopTimers() : void
    + PlayAudio(sendingRoom:string, timer:System.Timers.Timer, name:string) : void
    + BufferAudio(audio:List<(short, short)>, sample_rate:int) : void
}
MonoBehaviour <|-- AudioRecorder
@enduml
