@startuml
class UserReportScreenshot <<struct>> {
    + DataBase64 : string <<get>> <<set>>
    + DataIdentifier : string <<get>> <<set>>
    + FrameNumber : int <<get>> <<set>>
    + Height : int <<get>>
    + Width : int <<get>>
}
@enduml
