@startuml
abstract class AuthenticationBase {
    + Algorithm : string <<get>>
    + Nonce : string <<get>>
    + Opaque : string <<get>>
    + Qop : string <<get>>
    + Realm : string <<get>>
    + <<override>> ToString() : string
}
AuthenticationBase --> "Scheme" AuthenticationSchemes
@enduml
