@startuml
class Logger {
    + Logger()
    + Logger(level:LogLevel)
    + Logger(level:LogLevel, file:string, output:Action<LogData, string>)
    + File : string <<get>> <<set>>
    + Debug(message:string) : void
    + Error(message:string) : void
    + Fatal(message:string) : void
    + Info(message:string) : void
    + Trace(message:string) : void
    + Warn(message:string) : void
}
class "Action`2"<T1,T2> {
}
Logger --> "Level" LogLevel
Logger --> "Output<LogData,string>" "Action`2"
@enduml
