@startuml
class SliderManager {
    + enableSaving : bool = false
    + sliderTag : string = "My Slider"
    + usePercent : bool = false
    + showValue : bool = true
    + showPopupValue : bool = true
    + useRoundValue : bool = false
    + saveValue : float
    + LoadValues() : void
    + UpdateUI() : void
    + OnPointerEnter(eventData:PointerEventData) : void
    + OnPointerExit(eventData:PointerEventData) : void
}
class SliderEvent {
}
class "UnityEvent`1"<T> {
}
MonoBehaviour <|-- SliderManager
IPointerEnterHandler <|-- SliderManager
IPointerExitHandler <|-- SliderManager
SliderManager --> "mainSlider" Slider
SliderManager --> "valueText" TextMeshProUGUI
SliderManager --> "popupValueText" TextMeshProUGUI
SliderManager o-> "onValueChanged" SliderEvent
SliderManager --> "sliderEvent" SliderEvent
SliderManager --> "sliderAnimator" Animator
SliderManager +-- SliderEvent
"UnityEvent`1" "<float>" <|-- SliderEvent
@enduml
