@startuml
class UIManagerAnimatedIcon {
    + webglMode : bool = false
}
class "List`1"<T> {
}
MonoBehaviour <|-- UIManagerAnimatedIcon
UIManagerAnimatedIcon --> "UIManagerAsset" UIManager
UIManagerAnimatedIcon o-> "images<GameObject>" "List`1"
UIManagerAnimatedIcon o-> "imagesWithAlpha<GameObject>" "List`1"
@enduml
