@startuml
class HttpListener <<sealed>> {
    + HttpListener()
    + CertificateFolderPath : string <<get>> <<set>>
    + IgnoreWriteExceptions : bool <<get>> <<set>>
    + IsListening : bool <<get>>
    + {static} IsSupported : bool <<get>>
    + Realm : string <<get>> <<set>>
    + UnsafeConnectionNtlmAuthentication : bool <<get>> <<set>>
    + Abort() : void
    + BeginGetContext(callback:AsyncCallback, state:Object) : IAsyncResult
    + Close() : void
    + EndGetContext(asyncResult:IAsyncResult) : HttpListenerContext
    + GetContext() : HttpListenerContext
    + Start() : void
    + Stop() : void
}
class "Func`2"<T1,T2> {
}
IDisposable <|-- HttpListener
HttpListener --> "AuthenticationSchemes" AuthenticationSchemes
HttpListener --> "AuthenticationSchemeSelector<HttpListenerRequest,AuthenticationSchemes>" "Func`2"
HttpListener --> "DefaultCertificate" X509Certificate2
HttpListener --> "Prefixes" HttpListenerPrefixCollection
HttpListener --> "UserCredentialsFinder<IIdentity,NetworkCredential>" "Func`2"
@enduml
