@startuml
class UIManager {
    + hideWindows() : void
    + setUpTimers(pregame:float, charselect:float) : void
}
MonoBehaviour <|-- UIManager
UIManager --> "GM" GameManager
UIManager --> "VoiceWearManager" VoiceWearManagerLSD
UIManager --> "STT" VoskSpeechToText
UIManager --> "voiceManager" EOSVoiceManager
UIManager --> "Connect" SocketConnect
UIManager --> "spriteManager" SpriteManager
UIManager --> "audioController" AudioController
UIManager --> "deathAnimation" DeathAnimation
@enduml
