@startuml
class UIManagerProgressBar {
    + webglMode : bool = false
}
MonoBehaviour <|-- UIManagerProgressBar
UIManagerProgressBar --> "UIManagerAsset" UIManager
UIManagerProgressBar --> "bar" Image
UIManagerProgressBar --> "background" Image
UIManagerProgressBar --> "label" TextMeshProUGUI
@enduml
