@startuml
class SpriteManager {
    + CancelCoroutines() : void
    + ShowCharacterPreview(character:int) : void
    + Lights(lightsInt:int) : void
    + ShowCharacterDark(character:int) : void
    + ShowCharacter(character:int) : void
    + ShowRandomCharacterMonster() : void
    + SimpleShowCharacter(character:int) : void
    + HideCharacter() : void
    + SetUpAudience() : void
    + HideAllCharacters() : void
    + SetEmptyStage() : void
}
class "List`1"<T> {
}
MonoBehaviour <|-- SpriteManager
SpriteManager --> "backgroundAnimator" AnimatorScript
SpriteManager --> "charAnimators<AnimatorScript>" "List`1"
SpriteManager --> "DeathAnimation" DeathAnimation
SpriteManager --> "audioController" AudioController
SpriteManager --> "chair" AnimatorScript
SpriteManager --> "error" ErrorUI
SpriteManager --> "lights" Lights
@enduml
