@startuml
class ReadBufferState {
    + ReadBufferState(buffer:byte [], offset:int, count:int, asyncResult:HttpStreamAsyncResult)
    + Count : int <<get>> <<set>>
    + InitialCount : int <<get>> <<set>>
    + Offset : int <<get>> <<set>>
}
ReadBufferState --> "AsyncResult" HttpStreamAsyncResult
@enduml
