@startuml
class NullUserReportingPlatform {
    + DeserializeJson(json:string) : T
    + GetDeviceMetadata() : IDictionary<string, string>
    + ModifyUserReport(userReport:UserReport) : void
    + OnEndOfFrame(client:UserReportingClient) : void
    + Post(endpoint:string, contentType:string, content:byte[], progressCallback:Action<float, float>, callback:Action<bool, byte[]>) : void
    + RunTask(task:Func<object>, callback:Action<object>) : void
    + SendAnalyticsEvent(eventName:string, eventData:Dictionary<string, object>) : void
    + SerializeJson(instance:object) : string
    + TakeScreenshot(frameNumber:int, maximumWidth:int, maximumHeight:int, source:object, callback:Action<int, byte[]>) : void
    + Update(client:UserReportingClient) : void
}
IUserReportingPlatform <|-- NullUserReportingPlatform
@enduml
