@startuml
class PieChart {
    + borderThickness : float = 5
    + valuePrefix : string = "("
    + valueSuffix : string = ")"
    + addValueToIndicator : bool = true
    + enableBorderColor : bool
    + SetData(data:List<PieChartDataNode>) : void
    + UpdateIndicators() : void
    + ChangeValue(itemIndex:int, itemValue:float) : void
    + AddNewItem() : void
}
class "List`1"<T> {
}
class PieChartDataNode {
    + name : string = "Chart Item"
    + value : float = 10
}
MaskableGraphic <|-- PieChart
PieChart o-> "chartData<PieChartDataNode>" "List`1"
PieChart --> "indicatorParent" Transform
PieChart +-- PieChartDataNode
PieChartDataNode o-> "color" Color32
PieChartDataNode --> "indicatorImage" Image
PieChartDataNode --> "indicatorText" TextMeshProUGUI
@enduml
