@startuml
class HttpConnection <<sealed>> {
    + HttpConnection(socket:Socket, listener:EndPointListener)
    + IsClosed : bool <<get>>
    + IsSecure : bool <<get>>
    + Reuses : int <<get>>
    + BeginReadRequest() : void
    + Close() : void
    + GetRequestStream(chunked:bool, contentlength:long) : RequestStream
    + GetResponseStream() : ResponseStream
    + GetWebSocketStream() : WebSocketStream
    + SendError() : void
    + SendError(message:string, status:int) : void
}
HttpConnection --> "LocalEndPoint" IPEndPoint
HttpConnection --> "Prefix" ListenerPrefix
HttpConnection --> "RemoteEndPoint" IPEndPoint
HttpConnection --> "Stream" Stream
@enduml
