@startuml
class ChunkStream {
    + ChunkStream(buffer:byte [], offset:int, size:int, headers:WebHeaderCollection)
    + ChunkStream(headers:WebHeaderCollection)
    + ChunkLeft : int <<get>>
    + WantMore : bool <<get>>
    + Read(buffer:byte [], offset:int, size:int) : int
    + ResetBuffer() : void
    + Write(buffer:byte [], offset:int, size:int) : void
    + WriteAndReadBack(buffer:byte [], offset:int, size:int, read:int) : void
}
@enduml
