@startuml
class UIManagerButton {
    + webglMode : bool = false
}
enum ButtonType {
    BASIC,
    BASIC_ONLY_ICON,
    BASIC_WITH_ICON,
    BASIC_OUTLINE,
    BASIC_OUTLINE_ONLY_ICON,
    BASIC_OUTLINE_WITH_ICON,
    RADIAL_ONLY_ICON,
    RADIAL_OUTLINE_ONLY_ICON,
    ROUNDED,
    ROUNDED_OUTLINE,
}
MonoBehaviour <|-- UIManagerButton
UIManagerButton --> "UIManagerAsset" UIManager
UIManagerButton --> "buttonType" ButtonType
UIManagerButton --> "basicFilled" Image
UIManagerButton --> "basicText" TextMeshProUGUI
UIManagerButton --> "basicOnlyIconFilled" Image
UIManagerButton --> "basicOnlyIconIcon" Image
UIManagerButton --> "basicWithIconFilled" Image
UIManagerButton --> "basicWithIconIcon" Image
UIManagerButton --> "basicWithIconText" TextMeshProUGUI
UIManagerButton --> "basicOutlineBorder" Image
UIManagerButton --> "basicOutlineFilled" Image
UIManagerButton --> "basicOutlineText" TextMeshProUGUI
UIManagerButton --> "basicOutlineTextHighligted" TextMeshProUGUI
UIManagerButton --> "basicOutlineOOBorder" Image
UIManagerButton --> "basicOutlineOOFilled" Image
UIManagerButton --> "basicOutlineOOIcon" Image
UIManagerButton --> "basicOutlineOOIconHighlighted" Image
UIManagerButton --> "basicOutlineWOBorder" Image
UIManagerButton --> "basicOutlineWOFilled" Image
UIManagerButton --> "basicOutlineWOIcon" Image
UIManagerButton --> "basicOutlineWOIconHighlighted" Image
UIManagerButton --> "basicOutlineWOText" TextMeshProUGUI
UIManagerButton --> "basicOutlineWOTextHighligted" TextMeshProUGUI
UIManagerButton --> "radialOOBackground" Image
UIManagerButton --> "radialOOIcon" Image
UIManagerButton --> "radialOutlineOOBorder" Image
UIManagerButton --> "radialOutlineOOFilled" Image
UIManagerButton --> "radialOutlineOOIcon" Image
UIManagerButton --> "radialOutlineOOIconHighlighted" Image
UIManagerButton --> "roundedBackground" Image
UIManagerButton --> "roundedText" TextMeshProUGUI
UIManagerButton --> "roundedOutlineBorder" Image
UIManagerButton --> "roundedOutlineFilled" Image
UIManagerButton --> "roundedOutlineText" TextMeshProUGUI
UIManagerButton --> "roundedOutlineTextHighligted" TextMeshProUGUI
UIManagerButton +-- ButtonType
@enduml
