@startuml
class UIRoomDecidee {
    + JoinRoom(yourName:string, theirName:string, query:string, voiceskin:int, recordingID:string, otherPlayerSkin:int) : void
}
UIRoom <|-- UIRoomDecidee
@enduml
