@startuml
class PayloadData {
    + <<const>> MaxLength : ulong
    + PayloadData()
    + PayloadData(applicationData:byte [])
    + PayloadData(applicationData:string)
    + PayloadData(applicationData:byte [], masked:bool)
    + PayloadData(extensionData:byte [], applicationData:byte [], masked:bool)
    + IsMasked : bool <<get>>
    + Length : ulong <<get>>
    + GetEnumerator() : IEnumerator<byte>
    + Mask(maskingKey:byte []) : void
    + ToByteArray() : byte []
    + <<override>> ToString() : string
}
class "IEnumerable`1"<T> {
}
"IEnumerable`1" "<byte>" <|-- PayloadData
@enduml
