@startuml
class UserReportEvent <<struct>> {
    + FrameNumber : int <<get>> <<set>>
    + FullMessage : string <<get>>
    + Message : string <<get>> <<set>>
    + StackTrace : string <<get>> <<set>>
}
UserReportEvent --> "Exception" SerializableException
UserReportEvent --> "Level" UserReportEventLevel
UserReportEvent --> "Timestamp" DateTime
@enduml
