@startuml
class UnityUserReporting <<static>> {
    + {static} Configure(endpoint:string, projectIdentifier:string, platform:IUserReportingPlatform, configuration:UserReportingClientConfiguration) : void
    + {static} Configure(endpoint:string, projectIdentifier:string, configuration:UserReportingClientConfiguration) : void
    + {static} Configure(projectIdentifier:string, configuration:UserReportingClientConfiguration) : void
    + {static} Configure(projectIdentifier:string) : void
    + {static} Configure() : void
    + {static} Configure(configuration:UserReportingClientConfiguration) : void
    + {static} Configure(projectIdentifier:string, platform:IUserReportingPlatform, configuration:UserReportingClientConfiguration) : void
    + {static} Configure(platform:IUserReportingPlatform, configuration:UserReportingClientConfiguration) : void
    + {static} Configure(platform:IUserReportingPlatform) : void
    + {static} Use(client:UserReportingClient) : void
}
UnityUserReporting --> "CurrentClient" UserReportingClient
@enduml
