@startuml
class PlayerLobby {
    + isSelf : bool = false
    + Start() : void
    + setUserID(_userId:ProductUserId) : void
    + getUserID() : ProductUserId
    + setAdmin(val:bool) : void
    + setMonster(val:bool) : void
    + setUsername(val:string) : void
    + getUsername() : string
}
MonoBehaviour <|-- PlayerLobby
@enduml
