@startuml
class Replay {
    + maxPosition : int
    + id : string
    + IsPlaying() : bool
    + getPosition() : int
    + ChangeVoiceFilterValue(val:bool) : void
    + getVoiceFilterToggle() : bool
    + VoiceFilterToggle(val:bool) : void
    + Corrupt() : void
    + SliderEvent() : void
    + setParams(players:List<JSONObject>, question:string, id:string, maxTimeInMS:int) : void
    + Update() : void
    + SetState(val:ReplayUI.ReplayState, position:int) : void
}
MonoBehaviour <|-- Replay
Replay --> "playButton" Button
Replay --> "question" Text
Replay --> "stopButton" Button
Replay --> "pauseButton" Button
Replay --> "slider" Slider
Replay --> "userContainer" GameObject
Replay --> "replayUserFab" GameObject
Replay --> "playerContainer" GameObject
Replay --> "corruptText" GameObject
Replay --> "voiceFilterToggle" Toggle
Replay --> "parent" ReplayUI
Replay --> "outline" Outline
@enduml
