@startuml
class SerializableStackFrame {
    + SerializableStackFrame()
    + SerializableStackFrame(stackFrame:StackFrame)
    + DeclaringType : string <<get>> <<set>>
    + FileColumn : int <<get>> <<set>>
    + FileLine : int <<get>> <<set>>
    + FileName : string <<get>> <<set>>
    + Method : string <<get>> <<set>>
    + MethodName : string <<get>> <<set>>
}
@enduml
