@startuml
class TcpListenerWebSocketContext {
    + <<override>> Host : string <<get>>
    + <<override>> IsAuthenticated : bool <<get>>
    + <<override>> IsLocal : bool <<get>>
    + <<override>> IsSecureConnection : bool <<get>>
    + <<override>> IsWebSocketRequest : bool <<get>>
    + <<override>> Origin : string <<get>>
    + <<override>> SecWebSocketKey : string <<get>>
    + <<override>> SecWebSocketVersion : string <<get>>
    + <<override>> ToString() : string
}
class "IEnumerable`1"<T> {
}
WebSocketContext <|-- TcpListenerWebSocketContext
TcpListenerWebSocketContext --> "CookieCollection" CookieCollection
TcpListenerWebSocketContext --> "Headers" NameValueCollection
TcpListenerWebSocketContext --> "QueryString" NameValueCollection
TcpListenerWebSocketContext --> "RequestUri" Uri
TcpListenerWebSocketContext --> "SecWebSocketProtocols<string>" "IEnumerable`1"
TcpListenerWebSocketContext --> "User" IPrincipal
TcpListenerWebSocketContext --> "WebSocket" WebSocket
@enduml
