@startuml
class HandshakeRequest {
    + HttpMethod : string <<get>>
    + IsWebSocketRequest : bool <<get>>
    + RequestUri : string <<get>>
    + SetCookies(cookies:CookieCollection) : void
    + <<override>> ToString() : string
}
HandshakeBase <|-- HandshakeRequest
HandshakeRequest --> "AuthResponse" AuthenticationResponse
HandshakeRequest --> "Cookies" CookieCollection
@enduml
