@startuml
class AudioController {
    + SetVolumeMultiplier(volume:float) : void
    + SetMusicMultiplier(volume:float) : void
    + UpdateVolumes() : void
    + UpdateVolumesMusic() : void
    + SetVolume(source:AudioSource, newVolume:float) : void
    + SetVolumeMusic(source:AudioSource, newVolume:float) : void
    + StartWhispers() : void
    + PlayEndRiser() : void
    + LowerMainMenuMusic() : void
    + EndRiserIsPlaying() : bool
    + StopEndRiser() : void
    + PlayMainMenuMusic() : void
    + StopMainMenuMusic() : void
    + CrowdCheerTestSound() : void
    + PlayMonsterSound() : void
    + PlayCrowdCheer() : void
    + StopCrowdCheer() : void
    + StopWhispers() : void
    + IncreaseWhisperVolume(volume:float) : void
    + InRoomSounds(time:float) : void
    + StopRoomSounds() : void
    + LightSounds() : void
}
class "Dictionary`2"<T1,T2> {
}
MonoBehaviour <|-- AudioController
AudioController --> "whispers" AudioSource
AudioController --> "lightsounds" AudioSource
AudioController --> "ticktock" AudioSource
AudioController --> "monsterSound" AudioSource
AudioController --> "crowdCheer" AudioSource
AudioController --> "musicRound" AudioSource
AudioController --> "musicMainMenu" AudioSource
AudioController --> "roundEndRiser" AudioSource
AudioController --> "audioLevels<AudioSource,float>" "Dictionary`2"
AudioController --> "musicLevels<AudioSource,float>" "Dictionary`2"
@enduml
