@startuml
class CustomDropdown {
    + enableIcon : bool = true
    + enableTrigger : bool = true
    + enableScrollbar : bool = true
    + setHighPriorty : bool = true
    + outOnPointerExit : bool = false
    + isListItem : bool = false
    + invokeAtStart : bool = false
    + enableDropdownSounds : bool = false
    + useHoverSound : bool = true
    + useClickSound : bool = true
    + itemPaddingTop : int = 8
    + itemPaddingBottom : int = 8
    + itemPaddingLeft : int = 8
    + itemPaddingRight : int = 25
    + itemSpacing : int = 8
    + selectedItemIndex : int = 0
    + saveSelected : bool = false
    + dropdownTag : string = "Dropdown"
    + isOn : bool
    + index : int = 0
    + siblingIndex : int = 0
    + SetupDropdown() : void
    + ChangeDropdownInfo(itemIndex:int) : void
    + Animate() : void
    + CreateNewItem(title:string, icon:Sprite) : void
    + CreateNewItemFast(title:string, icon:Sprite) : void
    + RemoveItem(itemTitle:string) : void
    + AddNewItem() : void
    + UpdateItemLayout() : void
    + OnPointerClick(eventData:PointerEventData) : void
    + OnPointerEnter(eventData:PointerEventData) : void
    + OnPointerExit(eventData:PointerEventData) : void
}
class "List`1"<T> {
}
class DropdownEvent {
}
enum AnimationType {
    FADING,
    SLIDING,
    STYLISH,
}
class Item {
    + itemName : string = "Dropdown Item"
}
class "UnityEvent`1"<T> {
}
MonoBehaviour <|-- CustomDropdown
IPointerExitHandler <|-- CustomDropdown
IPointerEnterHandler <|-- CustomDropdown
IPointerClickHandler <|-- CustomDropdown
CustomDropdown --> "dropdownAnimator" Animator
CustomDropdown --> "triggerObject" GameObject
CustomDropdown --> "selectedText" TextMeshProUGUI
CustomDropdown --> "selectedImage" Image
CustomDropdown --> "itemParent" Transform
CustomDropdown --> "itemObject" GameObject
CustomDropdown --> "scrollbar" GameObject
CustomDropdown --> "itemList" VerticalLayoutGroup
CustomDropdown --> "listParent" Transform
CustomDropdown --> "soundSource" AudioSource
CustomDropdown --> "currentListParent" Transform
CustomDropdown --> "animationType" AnimationType
CustomDropdown o-> "dropdownItems<Item>" "List`1"
CustomDropdown --> "dropdownEvent" DropdownEvent
CustomDropdown --> "hoverSound" AudioClip
CustomDropdown --> "clickSound" AudioClip
CustomDropdown --> "setItemText" TextMeshProUGUI
CustomDropdown --> "setItemImage" Image
CustomDropdown +-- DropdownEvent
"UnityEvent`1" "<int>" <|-- DropdownEvent
CustomDropdown +-- AnimationType
CustomDropdown +-- Item
Item --> "itemIcon" Sprite
Item o-> "OnItemSelection" UnityEvent
@enduml
