@startuml
class Preconditions <<static>> {
    + {static} ArgumentIsLessThanOrEqualToLength(value:object, length:int, argumentName:string) : void
    + {static} ArgumentNotNullOrWhitespace(value:object, argumentName:string) : void
}
@enduml
