@startuml
class RequestStream {
    + <<override>> CanRead : bool <<get>>
    + <<override>> CanSeek : bool <<get>>
    + <<override>> CanWrite : bool <<get>>
    + <<override>> Length : long <<get>>
    + <<override>> Position : long <<get>> <<set>>
    + <<override>> BeginRead(buffer:byte [], offset:int, count:int, callback:AsyncCallback, state:object) : IAsyncResult
    + <<override>> BeginWrite(buffer:byte [], offset:int, count:int, callback:AsyncCallback, state:object) : IAsyncResult
    + <<override>> Close() : void
    + <<override>> EndRead(asyncResult:IAsyncResult) : int
    + <<override>> EndWrite(asyncResult:IAsyncResult) : void
    + <<override>> Flush() : void
    + <<override>> Read(buffer:byte [], offset:int, count:int) : int
    + <<override>> Seek(offset:long, origin:SeekOrigin) : long
    + <<override>> SetLength(value:long) : void
    + <<override>> Write(buffer:byte [], offset:int, count:int) : void
}
Stream <|-- RequestStream
@enduml
