@startuml
class UIManagerSlider {
    + hasLabel : bool
    + hasPopupLabel : bool
    + webglMode : bool = false
}
MonoBehaviour <|-- UIManagerSlider
UIManagerSlider --> "UIManagerAsset" UIManager
UIManagerSlider --> "background" Image
UIManagerSlider --> "bar" Image
UIManagerSlider --> "handle" Image
UIManagerSlider --> "label" TextMeshProUGUI
UIManagerSlider --> "popupLabel" TextMeshProUGUI
@enduml
