@startuml
class ContextMenuContentMobile {
    + holdToOpen : float = 0.75f
    + OnPointerDown(eventData:PointerEventData) : void
    + OnPointerUp(eventData:PointerEventData) : void
    + CheckForTimer() : void
    + CloseOnClick() : void
}
class "List`1"<T> {
}
class ContextItem {
    + itemText : string = "Item Text"
}
enum ContextItemType {
    BUTTON,
}
MonoBehaviour <|-- ContextMenuContentMobile
IPointerDownHandler <|-- ContextMenuContentMobile
IPointerUpHandler <|-- ContextMenuContentMobile
ContextMenuContentMobile --> "contextManager" ContextMenuManager
ContextMenuContentMobile --> "itemParent" Transform
ContextMenuContentMobile o-> "contexItems<ContextItem>" "List`1"
ContextMenuContentMobile +-- ContextItem
ContextItem --> "itemIcon" Sprite
ContextItem --> "contextItemType" ContextItemType
ContextItem --> "onClick" UnityEvent
ContextMenuContentMobile +-- ContextItemType
@enduml
