@startuml
class UserReportPreview {
    + UserReportPreview()
    + ContentLength : long <<get>> <<set>>
    + GeoCountry : string <<get>> <<set>>
    + Identifier : string <<get>> <<set>>
    + IPAddress : string <<get>> <<set>>
    + IsHiddenWithoutDimension : bool <<get>> <<set>>
    + IsSilent : bool <<get>> <<set>>
    + IsTemporary : bool <<get>> <<set>>
    + ProjectIdentifier : string <<get>> <<set>>
    + Summary : string <<get>> <<set>>
}
class "List`1"<T> {
}
UserReportPreview --> "AggregateMetrics<UserReportMetric>" "List`1"
UserReportPreview --> "AppearanceHint" UserReportAppearanceHint
UserReportPreview --> "Dimensions<UserReportNamedValue>" "List`1"
UserReportPreview --> "ExpiresOn" DateTime
UserReportPreview --> "LicenseLevel" LicenseLevel
UserReportPreview --> "ReceivedOn" DateTime
UserReportPreview --> "Thumbnail" UserReportScreenshot
@enduml
