@startuml
class SwitchManager {
    + saveValue : bool = true
    + switchTag : string = "Switch"
    + isOn : bool = true
    + invokeAtStart : bool = true
    + enableSwitchSounds : bool = false
    + useHoverSound : bool = true
    + useClickSound : bool = true
    + AnimateSwitch() : void
    + UpdateUI() : void
    + OnPointerEnter(eventData:PointerEventData) : void
}
MonoBehaviour <|-- SwitchManager
IPointerEnterHandler <|-- SwitchManager
SwitchManager --> "OnEvents" UnityEvent
SwitchManager --> "OffEvents" UnityEvent
SwitchManager --> "switchAnimator" Animator
SwitchManager --> "switchButton" Button
SwitchManager --> "soundSource" AudioSource
SwitchManager --> "hoverSound" AudioClip
SwitchManager --> "clickSound" AudioClip
@enduml
