@startuml
class LogData {
    + Message : string <<get>>
    + <<override>> ToString() : string
}
LogData --> "Caller" StackFrame
LogData --> "Date" DateTime
LogData --> "Level" LogLevel
@enduml
