@startuml
class MonsterSelectUI {
    + createMonsterUI(players:List<Player>, gameMode:int) : void
    + createMonsterPlayerPickUI(players:List<Player>, selectedplayer:string) : void
    + <<override>> show() : void
}
UIWindowTimer <|-- MonsterSelectUI
MonsterSelectUI --> "MonsterInfo" Text
MonsterSelectUI --> "Connect" SocketConnect
MonsterSelectUI --> "MonsterUIElement" GameObject
MonsterSelectUI --> "WaitForOtherMonsters" GameObject
MonsterSelectUI --> "MonsterSelectContainer" GameObject
MonsterSelectUI o-> "highlightedColor" Color32
@enduml
