@startuml
class RangeSlider {
    + decimalPlaces : int = 0
    + minValue : float = 0
    + maxValue : float = 1
    + showLabels : bool = true
    + useWholeNumbers : bool = true
    + CurrentLowerValue : float <<get>>
    + CurrentUpperValue : float <<get>>
    + CheckForMinState(value:float) : void
}
MonoBehaviour <|-- RangeSlider
RangeSlider --> "minSlider" RangeMinSlider
RangeSlider --> "minSliderLabel" TextMeshProUGUI
RangeSlider --> "maxSlider" RangeMaxSlider
RangeSlider --> "maxSliderLabel" TextMeshProUGUI
@enduml
