@startuml
class UIRoom {
    + JoinRoom(question:string, voiceskin:int, recordingID:string, otherPlayerSkin:int, roomType:int, otherPlayerName:string, myName:string, turnTime:float) : void
    + <<override>> hide() : void
}
UIWindowTimer <|-- UIRoom
UIRoom --> "_LightColors" LightColors
UIRoom --> "deathAnimation" DeathAnimation
UIRoom --> "spriteManager" SpriteManager
UIRoom --> "query" TextMeshProUGUI
UIRoom --> "audioController" AudioController
UIRoom --> "MatchSettings" MatchSettingsUI
UIRoom --> "UILoading" UIWindow
UIRoom --> "audioRecorder" AudioRecorder
UIRoom --> "PreRoomUI" PreRoomUI
UIRoom --> "RefreshQuery" Button
@enduml
