@startuml
class Ack {
    + packetId : int
    + Ack(packetId:int, action:System.Action<JSONObject>)
    + Invoke(ev:JSONObject) : void
    + <<override>> ToString() : string
}
Ack --> "time" DateTime
@enduml
