@startuml
class UIManagerTooltip {
    + webglMode : bool = false
}
MonoBehaviour <|-- UIManagerTooltip
UIManagerTooltip --> "UIManagerAsset" UIManager
UIManagerTooltip --> "background" Image
UIManagerTooltip --> "text" TextMeshProUGUI
@enduml
