@startuml
class UIManagerNotification {
    + webglMode : bool = false
}
MonoBehaviour <|-- UIManagerNotification
UIManagerNotification --> "UIManagerAsset" UIManager
UIManagerNotification --> "background" Image
UIManagerNotification --> "icon" Image
UIManagerNotification --> "title" TextMeshProUGUI
UIManagerNotification --> "description" TextMeshProUGUI
@enduml
