@startuml
class WebSocketFrame {
    + WebSocketFrame(opcode:Opcode, payload:PayloadData)
    + WebSocketFrame(opcode:Opcode, mask:Mask, payload:PayloadData)
    + WebSocketFrame(fin:Fin, opcode:Opcode, mask:Mask, payload:PayloadData)
    + WebSocketFrame(fin:Fin, opcode:Opcode, mask:Mask, payload:PayloadData, compressed:bool)
    + IsBinary : bool <<get>>
    + IsClose : bool <<get>>
    + IsCompressed : bool <<get>>
    + IsContinuation : bool <<get>>
    + IsControl : bool <<get>>
    + IsData : bool <<get>>
    + IsFinal : bool <<get>>
    + IsFragmented : bool <<get>>
    + IsMasked : bool <<get>>
    + IsPerMessageCompressed : bool <<get>>
    + IsPing : bool <<get>>
    + IsPong : bool <<get>>
    + IsText : bool <<get>>
    + Length : ulong <<get>>
    + PayloadLength : byte <<get>>
    + {static} CreateCloseFrame(mask:Mask, data:byte []) : WebSocketFrame
    + {static} CreateCloseFrame(mask:Mask, code:CloseStatusCode, reason:string) : WebSocketFrame
    + {static} CreateFrame(fin:Fin, opcode:Opcode, mask:Mask, data:byte [], compressed:bool) : WebSocketFrame
    + {static} CreatePingFrame(mask:Mask) : WebSocketFrame
    + {static} CreatePingFrame(mask:Mask, data:byte []) : WebSocketFrame
    + GetEnumerator() : IEnumerator<byte>
    + {static} Parse(src:byte []) : WebSocketFrame
    + {static} Parse(stream:Stream) : WebSocketFrame
    + {static} Parse(src:byte [], unmask:bool) : WebSocketFrame
    + {static} Parse(stream:Stream, unmask:bool) : WebSocketFrame
    + {static} ParseAsync(stream:Stream, completed:Action<WebSocketFrame>) : void
    + {static} ParseAsync(stream:Stream, completed:Action<WebSocketFrame>, error:Action<Exception>) : void
    + {static} ParseAsync(stream:Stream, unmask:bool, completed:Action<WebSocketFrame>, error:Action<Exception>) : void
    + Print(dumped:bool) : void
    + PrintToString(dumped:bool) : string
    + ToByteArray() : byte []
    + <<override>> ToString() : string
}
class "IEnumerable`1"<T> {
}
"IEnumerable`1" "<byte>" <|-- WebSocketFrame
WebSocketFrame --> "Fin" Fin
WebSocketFrame --> "Mask" Mask
WebSocketFrame --> "Opcode" Opcode
WebSocketFrame --> "PayloadData" PayloadData
WebSocketFrame --> "Rsv1" Rsv
WebSocketFrame --> "Rsv2" Rsv
WebSocketFrame --> "Rsv3" Rsv
@enduml
