@startuml
class UserReportAttachment <<struct>> {
    + UserReportAttachment(name:string, fileName:string, contentType:string, data:byte[])
    + ContentType : string <<get>> <<set>>
    + DataBase64 : string <<get>> <<set>>
    + DataIdentifier : string <<get>> <<set>>
    + FileName : string <<get>> <<set>>
    + Name : string <<get>> <<set>>
}
@enduml
