{
  "$schema": "https://docs.renovatebot.com/renovate-schema.json",
  "extends": [
    "config:recommended",
    "docker:pinDigests"
  ],
  "packageRules": [
    {
      "matchPackageNames": [
        "registry.gitlab.com/lenitech/docker/grafana"
      ],
      "changelogUrl": "https://github.com/grafana/grafana",
      "versioning": "loose"
    },
    {
      "matchUpdateTypes": [
        "patch",
        "digest"
      ],
      "automerge": true,
      "ignoreTests": true
    }
  ],
  "separateMinorPatch": true,
  "separateMultipleMajor": true
}
