{
  "type": "object",
  "required": [
    "name",
    "deploy_access_levels"
  ],
  "properties": {
    "name": { "type": "string" },
    "deploy_access_levels": { "type": "array", "items": { "$ref": "protected_ref_access.json" } },
    "required_approval_count": { "type":  "integer" },
    "approval_rules": { "type": "array", "items": { "$ref": "protected_environment_approval_rule.json" } }
  },
  "additionalProperties": false
}
