{
    "name": "Basic Dwarf",
    "race": "dwarf",
    "classes": [],
    "xp": 0,
    "xp avail": 0,
    "skills": {
        "Low Light Vision": "",
        "Slow Learner": ""
    },
    "stats": {
        "Hitpoints": { "base": 12, "current": 12, "regeneration": 1 },
        "Focus": { "base": 1, "current": 1, "regeneration": 1 },
        "Mana": { "base": 1, "current": 1, "regeneration": 1 },
        "Mana Pool": { "base": 1, "current": 1, "regeneration": 1 },
        "Reaction": { "base": 1, "current": 1, "regeneration": 1 }
    },
    "abilities": {
        "Agility": { "rank": 0 },
        "Archery": { "rank": -4 },
        "Crafting": { "rank": -1 },
        "Cunning": { "rank": -4 },
        "Dexterity": { "rank": 1 },
        "Insight": { "rank": -4 },
        "Knowledge": { "rank": -3 },
        "Medicine": { "rank": -3 },
        "Melee": { "rank": -1 },
        "Mind": { "rank": 0 },
        "Perception": { "rank": 0 },
        "Physique": { "rank": 1 },
        "Presence": { "rank": 0 },
        "Sorcery": { "rank": -4 },
        "Stealth": { "rank": -4 },
        "Survival": { "rank": -3 },
        "Warfare": { "rank": -2 },
        "Will": { "rank": 2 }
    }
}
