{
"Actor": {
  "types": ["character", "npc"],
  "templates": {
    "base": {
      "attributes": {
        "hp": {
          "value": 10,
          "min": 0,
          "max": 10
        },
        "ac": {
          "value": 0,
          "base": 0,
          "min": 0
        },
        "damage": {
          "value": "d6"
        },
        "level": {
          "value": 1,
          "min": 0,
          "max": 10
        },
        "xp": {
          "value": 0,
          "min": 0
        }
      }
    }
  },
  "character": {
    "templates": ["base"],
    "biography": "",
    "abilities": {
      "str": {
        "value": 10,
        "min": 3,
        "mod": 0,
        "debility": false
      },
      "dex": {
        "value": 10,
        "min": 3,
        "mod": 0,
        "debility": false
      },
      "con": {
        "value": 10,
        "min": 3,
        "mod": 0,
        "debility": false
      },
      "int": {
        "value": 10,
        "min": 3,
        "mod": 0,
        "debility": false
      },
      "wis": {
        "value": 10,
        "min": 3,
        "mod": 0,
        "debility": false
      },
      "cha": {
        "value": 10,
        "min": 3,
        "mod": 0,
        "debility": false
      }
    },
    "details": {
      "alignment": {
        "value": "",
        "description": ""
      },
      "look": "",
      "biography": "",
      "class": "",
      "race": {
        "value": "",
        "description": ""
      }
    }
  },
  "npc": {
    "templates": ["base"]
  }
},
"Item": {
  "types": ["move", "equipment", "spell"],
  "move": {
    "name": "",
    "description": "",
    "rollType": "",
    "rollMod": 0,
    "requiresLevel": 0,
    "requiresMove": "",
    "moveType": null
  },
  "equipment": {
    "description": "",
    "quantity": 1,
    "weight": 0,
    "attributes": {}
  },
  "spell": {
    "name": "",
    "description": "",
    "spellLevel": 0,
    "rollFormula": "",
    "prepared": false
  }
}
}
