﻿Strain,Stress,
0.004,10.1133,
0.008,22.77755,
0.012,27.48929,
0.016,40.66536,
0.020,54.37677,
0.024,61.9157,
0.028,75.33834,
0.032,79.94335,
0.036,92.19518,
0.040,101.72426,
0.044,122.05728,
0.048,106.75512,
0.052,128.96268,
0.056,133.12375,
0.060,135.44496,
0.064,167.2203,
0.068,169.65172,
0.072,189.07668,
0.076,211.25816,
0.080,187.92146,
0.084,209.734,
0.088,222.96042,
0.092,237.22415,
0.096,221.37303,
0.100,231.34984,
0.104,237.71418,
0.108,270.1086,
0.112,303.67536,
0.116,284.94345,
0.120,296.68806,
0.124,343.987,
0.128,298.40478,
0.132,318.84765,
0.136,320.49847,
0.140,344.74572,
0.144,396.5802,
0.148,346.3185,
0.152,383.53868,
0.156,444.10392,
0.160,382.58912,
0.164,377.69292,
0.168,407.86224,
0.172,486.37698,
0.176,404.86311,
0.180,425.45685,
0.184,432.352,
0.188,532.69388,
0.192,549.58553,
0.196,515.7432,
0.200,475.54186,
0.204,500.4203,
0.208,581.60949,
0.212,608.08856,
0.216,596.1571,
0.220,531.46375,
0.224,618.85605,
0.228,612.46976,
0.232,652.26708,
0.236,544.51425,
0.240,627.1163,
0.244,592.44432,
0.248,622.06529,
0.252,695.1735,
0.256,689.52,
0.260,749.49125,
0.264,636.87801,
0.268,724.1205,
0.272,710.68032,
0.276,645.2061,
0.280,780.72856,
0.284,822.42222,
0.288,768.07427,
0.292,674.93952,
0.296,845.96616,
0.300,827.08395,
0.304,704.8098,
0.308,799.6383,
0.312,797.31584,
0.316,818.27073,
0.320,767.1009,
0.324,810.53088,
0.328,847.02472,
0.332,770.4477,
0.336,844.06068,
0.340,814.3344,
0.344,873.87719,
0.348,894.30591,
0.352,817.30492,
0.356,885.72395,
0.360,831.95152,
0.364,871.89352,
0.368,838.52874,
0.372,933.81189,
0.376,918.3027,
0.380,868.5984,
0.384,984.57813,
0.388,891.33035,
0.392,956.87672,
0.396,1010.9528,
0.400,978.97813,
