{
  "project_info": {
    "project_number": "787858716234",
    "project_id": "tradeal-601a3",
    "storage_bucket": "tradeal-601a3.appspot.com"
  },
  "client": [
    {
      "client_info": {
        "mobilesdk_app_id": "1:787858716234:android:b4b3a1389e7002c2f298b3",
        "android_client_info": {
          "package_name": "com.example.tradeal"
        }
      },
      "oauth_client": [
        {
          "client_id": "787858716234-bkmnb5l36tumtqp3b2190ckrhulh28am.apps.googleusercontent.com",
          "client_type": 3
        }
      ],
      "api_key": [
        {
          "current_key": "AIzaSyDArdflY5wDid2ydOEsrUXgdedcTuLNzqE"
        }
      ],
      "services": {
        "appinvite_service": {
          "other_platform_oauth_client": [
            {
              "client_id": "787858716234-bkmnb5l36tumtqp3b2190ckrhulh28am.apps.googleusercontent.com",
              "client_type": 3
            }
          ]
        }
      }
    }
  ],
  "configuration_version": "1"
}