{
  "category": [
    {
      "id": "category_1",
      "name": "Đồ uống"
    },
    {
      "id": "category_2",
      "name": "Đồ ăn"
    },
    {
      "id": "category_3",
      "name": "Khác ..."
    }
  ],
  "products": [
    {
      "id": 1,
      "images": [
        {
          "url":
            "https://png.pngtree.com/element_origin_min_pic/17/01/09/b5b3d15abb15d8a79bdcb259a9cb6ee8.jpg"
        }
      ],
      "name": "macbook Air 2019",
      "price": "500000",
      "category": "category_1"
    },
    {
      "id": 2,
      "images": [
        {
          "url":
            "https://png.pngtree.com/element_origin_min_pic/17/01/09/b5b3d15abb15d8a79bdcb259a9cb6ee8.jpg"
        }
      ],
      "name": "macbook Pro 2019",
      "price": "500000",
      "category": "category_2"
    },
    {
      "id": 1,
      "images": [
        {
          "url":
            "https://png.pngtree.com/element_origin_min_pic/17/01/09/b5b3d15abb15d8a79bdcb259a9cb6ee8.jpg"
        }
      ],
      "name": "macbook Air 2019",
      "price": "500000",
      "category": "category_1"
    },
    {
      "id": 2,
      "images": [
        {
          "url":
            "https://png.pngtree.com/element_origin_min_pic/17/01/09/b5b3d15abb15d8a79bdcb259a9cb6ee8.jpg"
        }
      ],
      "name": "macbook Pro 2019",
      "price": "500000",
      "category": "category_2"
    },
    {
      "id": 1,
      "images": [
        {
          "url":
            "https://png.pngtree.com/element_origin_min_pic/17/01/09/b5b3d15abb15d8a79bdcb259a9cb6ee8.jpg"
        }
      ],
      "name": "macbook Air 2019",
      "price": "500000",
      "category": "category_3"
    },
    {
      "id": 2,
      "images": [
        {
          "url":
            "https://png.pngtree.com/element_origin_min_pic/17/01/09/b5b3d15abb15d8a79bdcb259a9cb6ee8.jpg"
        }
      ],
      "name": "macbook Pro 2019",
      "price": "500000",
      "category": "category_2"
    }
  ]
}