[gd_resource type="GDNativeLibrary" format=2]

[resource]
entry/Windows.64 = "res://lib/win64/libgdnative.so"
entry/X11.64 = "res://lib/x11/libgdnative.so"
dependency/Windows.64 = [  ]
dependency/X11.64 = [  ]
