Time,GPS_HEADER,GPS_LATITUDE,GPS_LONGITUDE,GPS_ALTITUDE,GPS_EASTING,GPS_NORTHING,GPS_ZONE_NUMBER,GPS_ZONE_LETTER
1644449409.2668982,[-----GPS DATA-----],42.33879470825195,-71.08808898925781,14.0,327986.09375,4689505.0,19,T
1644449410.3285577,[-----GPS DATA-----],42.33879470825195,-71.08808898925781,14.0,327986.09375,4689505.0,19,T
1644449411.2732773,[-----GPS DATA-----],42.33879470825195,-71.08808898925781,14.0,327986.09375,4689505.0,19,T
1644449412.267153,[-----GPS DATA-----],42.33879470825195,-71.08808898925781,14.0,327986.09375,4689505.0,19,T
1644449413.2669,[-----GPS DATA-----],42.33879470825195,-71.08808898925781,14.0,327986.09375,4689505.0,19,T
1644449414.2642317,[-----GPS DATA-----],42.33879470825195,-71.08808898925781,14.0,327986.09375,4689505.0,19,T
1644449415.3221762,[-----GPS DATA-----],42.33879470825195,-71.08808898925781,14.0,327986.09375,4689505.0,19,T
1644449416.263748,[-----GPS DATA-----],42.33879470825195,-71.08808898925781,14.0,327986.09375,4689505.0,19,T
1644449417.266303,[-----GPS DATA-----],42.33879470825195,-71.08808898925781,14.0,327986.09375,4689505.0,19,T
1644449418.2638705,[-----GPS DATA-----],42.33879470825195,-71.08808898925781,14.0,327986.09375,4689505.0,19,T
1644449419.2676008,[-----GPS DATA-----],42.33879470825195,-71.08808898925781,14.0,327986.09375,4689505.0,19,T
1644449420.3301995,[-----GPS DATA-----],42.33879470825195,-71.08808898925781,14.0,327986.09375,4689505.0,19,T
1644449421.2688553,[-----GPS DATA-----],42.33879470825195,-71.08808898925781,14.0,327986.09375,4689505.0,19,T
1644449422.2725036,[-----GPS DATA-----],42.33879470825195,-71.08808898925781,14.0,327986.09375,4689505.0,19,T
1644449423.2660782,[-----GPS DATA-----],42.33879470825195,-71.08808898925781,14.0,327986.09375,4689505.0,19,T
1644449424.2660584,[-----GPS DATA-----],42.33879470825195,-71.08808898925781,14.0,327986.09375,4689505.0,19,T
1644449425.3289044,[-----GPS DATA-----],42.33879470825195,-71.08808898925781,14.0,327986.09375,4689505.0,19,T
1644449426.2659912,[-----GPS DATA-----],42.33879470825195,-71.08808898925781,14.0,327986.09375,4689505.0,19,T
1644449427.2673712,[-----GPS DATA-----],42.33879470825195,-71.08808898925781,14.0,327986.09375,4689505.0,19,T
1644449428.2659714,[-----GPS DATA-----],42.33879470825195,-71.08808898925781,14.0,327986.09375,4689505.0,19,T
1644449429.2622313,[-----GPS DATA-----],42.33879470825195,-71.08808898925781,14.0,327986.09375,4689505.0,19,T
1644449430.322575,[-----GPS DATA-----],42.33879470825195,-71.08808898925781,14.0,327986.09375,4689505.0,19,T
1644449431.2671347,[-----GPS DATA-----],42.33879470825195,-71.08808898925781,14.0,327986.09375,4689505.0,19,T
1644449432.2655897,[-----GPS DATA-----],42.33879470825195,-71.08808898925781,14.0,327986.09375,4689505.0,19,T
1644449433.2624726,[-----GPS DATA-----],42.33879470825195,-71.08808898925781,14.0,327986.09375,4689505.0,19,T
1644449434.2640903,[-----GPS DATA-----],42.33879470825195,-71.08808898925781,14.0,327986.09375,4689505.0,19,T
1644449435.322334,[-----GPS DATA-----],42.33879470825195,-71.08808898925781,14.0,327986.09375,4689505.0,19,T
1644449436.2632086,[-----GPS DATA-----],42.33879470825195,-71.08808898925781,14.0,327986.09375,4689505.0,19,T
1644449437.2617671,[-----GPS DATA-----],42.33879470825195,-71.08808898925781,14.0,327986.09375,4689505.0,19,T
1644449438.2605906,[-----GPS DATA-----],42.33879470825195,-71.08808898925781,14.100000381469727,327986.09375,4689505.0,19,T
1644449439.263946,[-----GPS DATA-----],42.33879470825195,-71.08808898925781,14.100000381469727,327986.09375,4689505.0,19,T
1644449440.3247645,[-----GPS DATA-----],42.33879470825195,-71.08808898925781,14.100000381469727,327986.09375,4689505.0,19,T
1644449441.2608788,[-----GPS DATA-----],42.33879470825195,-71.08808898925781,14.100000381469727,327986.09375,4689505.0,19,T
1644449442.2621918,[-----GPS DATA-----],42.33879470825195,-71.08808898925781,14.100000381469727,327986.09375,4689505.0,19,T
1644449443.2639906,[-----GPS DATA-----],42.33879470825195,-71.08808898925781,14.100000381469727,327986.09375,4689505.0,19,T
1644449444.2634144,[-----GPS DATA-----],42.33879470825195,-71.08808898925781,14.100000381469727,327986.09375,4689505.0,19,T
1644449445.3190868,[-----GPS DATA-----],42.33879470825195,-71.08808898925781,14.100000381469727,327986.09375,4689505.0,19,T
1644449446.2992675,[-----GPS DATA-----],42.33879470825195,-71.08808898925781,14.100000381469727,327986.09375,4689505.0,19,T
1644449447.2631404,[-----GPS DATA-----],42.33879470825195,-71.08808898925781,14.100000381469727,327986.09375,4689505.0,19,T
1644449448.2605283,[-----GPS DATA-----],42.33879470825195,-71.08808898925781,14.100000381469727,327986.09375,4689505.0,19,T
1644449449.2674682,[-----GPS DATA-----],42.33879470825195,-71.08808898925781,14.100000381469727,327986.09375,4689505.0,19,T
1644449450.3298182,[-----GPS DATA-----],42.33879470825195,-71.08808898925781,14.100000381469727,327986.09375,4689505.0,19,T
1644449451.302739,[-----GPS DATA-----],42.33879470825195,-71.08808898925781,14.100000381469727,327986.09375,4689505.0,19,T
1644449452.266238,[-----GPS DATA-----],42.33879470825195,-71.08808898925781,14.100000381469727,327986.09375,4689505.0,19,T
1644449453.267813,[-----GPS DATA-----],42.33879470825195,-71.08808898925781,14.100000381469727,327986.09375,4689505.0,19,T
1644449454.3044236,[-----GPS DATA-----],42.33879470825195,-71.08808898925781,14.100000381469727,327986.09375,4689505.0,19,T
1644449455.3661256,[-----GPS DATA-----],42.33879470825195,-71.08808898925781,14.100000381469727,327986.09375,4689505.0,19,T
1644449456.267086,[-----GPS DATA-----],42.33879470825195,-71.08808898925781,14.100000381469727,327986.09375,4689505.0,19,T
1644449457.2667115,[-----GPS DATA-----],42.33879470825195,-71.08808898925781,14.100000381469727,327986.09375,4689505.0,19,T
1644449458.2654927,[-----GPS DATA-----],42.33879470825195,-71.08808898925781,14.100000381469727,327986.09375,4689505.0,19,T
1644449459.2685905,[-----GPS DATA-----],42.33879470825195,-71.08808898925781,14.100000381469727,327986.09375,4689505.0,19,T
1644449460.3310544,[-----GPS DATA-----],42.33879470825195,-71.08808898925781,14.100000381469727,327986.09375,4689505.0,19,T
1644449461.2639923,[-----GPS DATA-----],42.33879470825195,-71.08808898925781,14.199999809265137,327986.09375,4689505.0,19,T
1644449462.265873,[-----GPS DATA-----],42.33879470825195,-71.08808898925781,14.199999809265137,327986.09375,4689505.0,19,T
1644449463.2642314,[-----GPS DATA-----],42.33879470825195,-71.08808898925781,14.199999809265137,327986.09375,4689505.0,19,T
1644449464.2614973,[-----GPS DATA-----],42.33879470825195,-71.08808898925781,14.199999809265137,327986.09375,4689505.0,19,T
1644449465.3186688,[-----GPS DATA-----],42.33879470825195,-71.08808898925781,14.199999809265137,327986.09375,4689505.0,19,T
1644449466.2590046,[-----GPS DATA-----],42.33879470825195,-71.08808898925781,14.199999809265137,327986.21875,4689505.0,19,T
1644449467.2588198,[-----GPS DATA-----],42.33879470825195,-71.08808898925781,14.199999809265137,327986.21875,4689505.0,19,T
1644449468.2656906,[-----GPS DATA-----],42.33879470825195,-71.08808898925781,14.199999809265137,327986.21875,4689505.0,19,T
1644449469.2672367,[-----GPS DATA-----],42.33879470825195,-71.08808898925781,14.199999809265137,327986.21875,4689505.0,19,T
1644449470.328995,[-----GPS DATA-----],42.33879470825195,-71.08808898925781,14.199999809265137,327986.21875,4689505.0,19,T
1644449471.2656384,[-----GPS DATA-----],42.33879470825195,-71.08808898925781,14.199999809265137,327986.21875,4689505.0,19,T
1644449472.2664692,[-----GPS DATA-----],42.33879470825195,-71.08808898925781,14.199999809265137,327986.21875,4689505.0,19,T
1644449473.2651086,[-----GPS DATA-----],42.33879470825195,-71.08808898925781,14.199999809265137,327986.21875,4689505.0,19,T
1644449474.2682183,[-----GPS DATA-----],42.33879470825195,-71.08808898925781,14.199999809265137,327986.21875,4689505.0,19,T
1644449475.3304825,[-----GPS DATA-----],42.33879470825195,-71.08808898925781,14.199999809265137,327986.21875,4689505.0,19,T
1644449476.2683847,[-----GPS DATA-----],42.33879470825195,-71.08808898925781,14.199999809265137,327986.21875,4689505.0,19,T
1644449477.2680511,[-----GPS DATA-----],42.33879470825195,-71.08808898925781,14.199999809265137,327986.21875,4689505.0,19,T
1644449478.2684445,[-----GPS DATA-----],42.33879470825195,-71.08808898925781,14.199999809265137,327986.21875,4689505.0,19,T
1644449479.2682922,[-----GPS DATA-----],42.33879470825195,-71.08808898925781,14.199999809265137,327986.21875,4689505.0,19,T
1644449480.33048,[-----GPS DATA-----],42.33879470825195,-71.08808898925781,14.199999809265137,327986.21875,4689505.0,19,T
1644449481.268551,[-----GPS DATA-----],42.33879470825195,-71.08808898925781,14.199999809265137,327986.21875,4689505.0,19,T
1644449482.2686083,[-----GPS DATA-----],42.33879470825195,-71.08808898925781,14.199999809265137,327986.09375,4689505.0,19,T
1644449483.2687185,[-----GPS DATA-----],42.33879470825195,-71.08808898925781,14.199999809265137,327986.09375,4689505.0,19,T
1644449484.2632973,[-----GPS DATA-----],42.33879470825195,-71.08808898925781,14.199999809265137,327986.09375,4689505.0,19,T
1644449485.3202736,[-----GPS DATA-----],42.33879470825195,-71.08808898925781,14.199999809265137,327986.09375,4689505.0,19,T
1644449486.2659304,[-----GPS DATA-----],42.33879470825195,-71.08808898925781,14.300000190734863,327986.09375,4689505.0,19,T
1644449487.2652166,[-----GPS DATA-----],42.33879470825195,-71.08808898925781,14.300000190734863,327986.09375,4689505.0,19,T
1644449488.2681887,[-----GPS DATA-----],42.33879470825195,-71.08808898925781,14.300000190734863,327986.09375,4689505.0,19,T
1644449489.2654958,[-----GPS DATA-----],42.33879470825195,-71.08808898925781,14.300000190734863,327986.09375,4689505.0,19,T
1644449490.3218465,[-----GPS DATA-----],42.33879470825195,-71.08808898925781,14.300000190734863,327986.09375,4689505.0,19,T
1644449491.265592,[-----GPS DATA-----],42.33879470825195,-71.08808898925781,14.300000190734863,327986.09375,4689505.0,19,T
1644449492.2671018,[-----GPS DATA-----],42.33879470825195,-71.08808898925781,14.300000190734863,327986.09375,4689505.0,19,T
1644449493.267977,[-----GPS DATA-----],42.33879470825195,-71.08808898925781,14.300000190734863,327986.09375,4689505.0,19,T
1644449494.2654812,[-----GPS DATA-----],42.33879470825195,-71.08808898925781,14.300000190734863,327986.09375,4689505.0,19,T
1644449495.3219383,[-----GPS DATA-----],42.33879470825195,-71.08808898925781,14.300000190734863,327986.09375,4689505.0,19,T
1644449496.3020456,[-----GPS DATA-----],42.33879470825195,-71.08808898925781,14.300000190734863,327986.09375,4689505.0,19,T
1644449497.264126,[-----GPS DATA-----],42.33879470825195,-71.08808898925781,14.300000190734863,327986.09375,4689505.0,19,T
1644449498.2665658,[-----GPS DATA-----],42.33879470825195,-71.08808898925781,14.300000190734863,327986.09375,4689505.0,19,T
1644449499.263175,[-----GPS DATA-----],42.33879470825195,-71.08808898925781,14.300000190734863,327986.09375,4689505.0,19,T
1644449500.3209486,[-----GPS DATA-----],42.33879470825195,-71.08808898925781,14.300000190734863,327986.09375,4689505.0,19,T
1644449501.2644842,[-----GPS DATA-----],42.33879470825195,-71.08808898925781,14.300000190734863,327986.09375,4689505.0,19,T
1644449502.26843,[-----GPS DATA-----],42.33879470825195,-71.08808898925781,14.300000190734863,327986.09375,4689505.0,19,T
1644449503.2621891,[-----GPS DATA-----],42.33879470825195,-71.08808898925781,14.300000190734863,327986.09375,4689505.0,19,T
1644449504.2621858,[-----GPS DATA-----],42.33879470825195,-71.08808898925781,14.300000190734863,327986.09375,4689505.0,19,T
1644449505.3190417,[-----GPS DATA-----],42.33879852294922,-71.08808898925781,14.300000190734863,327986.09375,4689505.0,19,T
1644449506.2627466,[-----GPS DATA-----],42.33879852294922,-71.08808898925781,14.300000190734863,327986.09375,4689505.0,19,T
1644449507.2635202,[-----GPS DATA-----],42.33879852294922,-71.08808898925781,14.300000190734863,327986.09375,4689505.0,19,T
1644449508.2662706,[-----GPS DATA-----],42.33879852294922,-71.08808898925781,14.300000190734863,327986.09375,4689505.0,19,T
1644449509.266659,[-----GPS DATA-----],42.33879852294922,-71.08808898925781,14.300000190734863,327986.09375,4689505.0,19,T
1644449510.3226643,[-----GPS DATA-----],42.33879852294922,-71.08808898925781,14.300000190734863,327986.09375,4689505.0,19,T
1644449511.3039806,[-----GPS DATA-----],42.33879852294922,-71.08808898925781,14.300000190734863,327986.09375,4689505.0,19,T
1644449512.2625175,[-----GPS DATA-----],42.33879852294922,-71.08808898925781,14.300000190734863,327986.09375,4689505.0,19,T
1644449513.265144,[-----GPS DATA-----],42.33879852294922,-71.08808898925781,14.300000190734863,327986.09375,4689505.0,19,T
1644449514.2659333,[-----GPS DATA-----],42.33879852294922,-71.08808898925781,14.300000190734863,327986.09375,4689505.0,19,T
1644449515.3285592,[-----GPS DATA-----],42.33879852294922,-71.08808898925781,14.300000190734863,327986.09375,4689505.0,19,T
1644449516.2660506,[-----GPS DATA-----],42.33879852294922,-71.08808898925781,14.300000190734863,327986.09375,4689505.0,19,T
1644449517.2672598,[-----GPS DATA-----],42.33879852294922,-71.08808898925781,14.300000190734863,327986.09375,4689505.0,19,T
1644449518.262851,[-----GPS DATA-----],42.33879852294922,-71.08808898925781,14.399999618530273,327986.09375,4689505.0,19,T
1644449519.2633555,[-----GPS DATA-----],42.33879852294922,-71.08808898925781,14.399999618530273,327986.09375,4689505.0,19,T
1644449520.3197305,[-----GPS DATA-----],42.33879852294922,-71.08808898925781,14.399999618530273,327986.09375,4689505.0,19,T
1644449521.304742,[-----GPS DATA-----],42.33879852294922,-71.08808898925781,14.399999618530273,327986.09375,4689505.0,19,T
1644449522.3045096,[-----GPS DATA-----],42.33879852294922,-71.08808898925781,14.399999618530273,327986.09375,4689505.0,19,T
1644449523.2651923,[-----GPS DATA-----],42.33879852294922,-71.08808898925781,14.399999618530273,327986.09375,4689505.0,19,T
1644449524.2687485,[-----GPS DATA-----],42.33879852294922,-71.08808898925781,14.399999618530273,327986.09375,4689505.0,19,T
1644449525.330493,[-----GPS DATA-----],42.33879852294922,-71.08808898925781,14.399999618530273,327986.09375,4689505.0,19,T
1644449526.2659154,[-----GPS DATA-----],42.33879852294922,-71.08808898925781,14.399999618530273,327986.09375,4689505.0,19,T
1644449527.2658951,[-----GPS DATA-----],42.33879852294922,-71.08808898925781,14.399999618530273,327986.09375,4689505.0,19,T
1644449528.270903,[-----GPS DATA-----],42.33879852294922,-71.08808898925781,14.399999618530273,327986.09375,4689505.5,19,T
1644449529.2657957,[-----GPS DATA-----],42.33879852294922,-71.08808898925781,14.399999618530273,327986.09375,4689505.5,19,T
1644449530.3271573,[-----GPS DATA-----],42.33879852294922,-71.08808898925781,14.399999618530273,327986.09375,4689505.5,19,T
1644449531.2684696,[-----GPS DATA-----],42.33879852294922,-71.08808898925781,14.399999618530273,327986.09375,4689505.5,19,T
1644449532.2685616,[-----GPS DATA-----],42.33879852294922,-71.08808898925781,14.399999618530273,327986.09375,4689505.5,19,T
1644449533.26761,[-----GPS DATA-----],42.33879852294922,-71.08808898925781,14.399999618530273,327986.09375,4689505.5,19,T
1644449534.26465,[-----GPS DATA-----],42.33879852294922,-71.08808898925781,14.399999618530273,327986.09375,4689505.5,19,T
1644449535.3249393,[-----GPS DATA-----],42.33879852294922,-71.08808898925781,14.399999618530273,327986.09375,4689505.5,19,T
1644449536.2647083,[-----GPS DATA-----],42.33879852294922,-71.08808898925781,14.399999618530273,327986.09375,4689505.5,19,T
1644449537.2644444,[-----GPS DATA-----],42.33879852294922,-71.08808898925781,14.399999618530273,327986.09375,4689505.5,19,T
1644449538.26834,[-----GPS DATA-----],42.33879852294922,-71.08808898925781,14.399999618530273,327986.09375,4689505.5,19,T
1644449539.266531,[-----GPS DATA-----],42.33879852294922,-71.08808898925781,14.399999618530273,327986.09375,4689505.5,19,T
1644449540.329026,[-----GPS DATA-----],42.33879852294922,-71.08808898925781,14.399999618530273,327986.09375,4689505.5,19,T
1644449541.267084,[-----GPS DATA-----],42.33879852294922,-71.08808898925781,14.399999618530273,327986.09375,4689505.5,19,T
1644449542.2678761,[-----GPS DATA-----],42.33879852294922,-71.08808898925781,14.399999618530273,327986.09375,4689505.5,19,T
1644449543.2681713,[-----GPS DATA-----],42.33879852294922,-71.08808898925781,14.399999618530273,327986.09375,4689505.5,19,T
1644449544.2650144,[-----GPS DATA-----],42.33879852294922,-71.08808898925781,14.399999618530273,327986.09375,4689505.5,19,T
1644449545.3252287,[-----GPS DATA-----],42.33879852294922,-71.08808898925781,14.399999618530273,327986.09375,4689505.5,19,T
1644449546.2665951,[-----GPS DATA-----],42.33879852294922,-71.08808898925781,14.399999618530273,327986.09375,4689505.5,19,T
1644449547.3027434,[-----GPS DATA-----],42.33879852294922,-71.08808898925781,14.399999618530273,327986.09375,4689505.5,19,T
1644449548.2680774,[-----GPS DATA-----],42.33879852294922,-71.08808898925781,14.399999618530273,327986.09375,4689505.5,19,T
1644449549.2643833,[-----GPS DATA-----],42.33879852294922,-71.08808898925781,14.399999618530273,327986.09375,4689505.5,19,T
1644449550.3251975,[-----GPS DATA-----],42.33879852294922,-71.08808898925781,14.399999618530273,327986.09375,4689505.5,19,T
1644449551.2648165,[-----GPS DATA-----],42.33879852294922,-71.08808898925781,14.5,327986.09375,4689505.5,19,T
1644449552.2683518,[-----GPS DATA-----],42.33879852294922,-71.08808898925781,14.5,327986.09375,4689505.5,19,T
1644449553.2649112,[-----GPS DATA-----],42.33879852294922,-71.08808898925781,14.5,327986.09375,4689505.5,19,T
1644449554.267529,[-----GPS DATA-----],42.33879852294922,-71.08808898925781,14.5,327986.09375,4689505.5,19,T
1644449555.32926,[-----GPS DATA-----],42.33879852294922,-71.08808898925781,14.5,327986.09375,4689505.5,19,T
1644449556.2673993,[-----GPS DATA-----],42.33879852294922,-71.08808898925781,14.5,327986.09375,4689505.5,19,T
1644449557.263308,[-----GPS DATA-----],42.33879852294922,-71.08808898925781,14.5,327986.09375,4689505.5,19,T
1644449558.2659283,[-----GPS DATA-----],42.33879852294922,-71.08808898925781,14.5,327986.09375,4689505.5,19,T
1644449559.2651248,[-----GPS DATA-----],42.33879852294922,-71.08808898925781,14.5,327986.09375,4689505.5,19,T
1644449560.32277,[-----GPS DATA-----],42.33879852294922,-71.08808898925781,14.5,327986.09375,4689505.5,19,T
1644449561.2618182,[-----GPS DATA-----],42.33879852294922,-71.08808898925781,14.600000381469727,327986.09375,4689505.5,19,T
1644449562.302737,[-----GPS DATA-----],42.33879852294922,-71.08808898925781,14.600000381469727,327986.09375,4689505.5,19,T
1644449563.268982,[-----GPS DATA-----],42.33879852294922,-71.08808898925781,14.600000381469727,327986.09375,4689505.5,19,T
1644449564.2672625,[-----GPS DATA-----],42.33879852294922,-71.08808898925781,14.600000381469727,327986.09375,4689505.5,19,T
1644449565.3297036,[-----GPS DATA-----],42.33879852294922,-71.08808898925781,14.600000381469727,327986.09375,4689505.5,19,T
1644449566.265334,[-----GPS DATA-----],42.33879852294922,-71.08808898925781,14.600000381469727,327986.09375,4689505.5,19,T
1644449567.268444,[-----GPS DATA-----],42.33879852294922,-71.08808898925781,14.699999809265137,327985.96875,4689505.5,19,T
1644449568.269309,[-----GPS DATA-----],42.33879852294922,-71.08808898925781,14.699999809265137,327985.96875,4689505.5,19,T
1644449569.2657413,[-----GPS DATA-----],42.33879852294922,-71.08808898925781,14.699999809265137,327985.96875,4689505.5,19,T
1644449570.3268363,[-----GPS DATA-----],42.33879852294922,-71.08808898925781,14.699999809265137,327985.96875,4689505.5,19,T
1644449571.3047118,[-----GPS DATA-----],42.33879852294922,-71.08808898925781,14.699999809265137,327985.96875,4689505.5,19,T
1644449572.2683258,[-----GPS DATA-----],42.33879852294922,-71.08808898925781,14.800000190734863,327985.96875,4689505.5,19,T
1644449573.304534,[-----GPS DATA-----],42.33879852294922,-71.08808898925781,14.800000190734863,327985.96875,4689505.5,19,T
1644449574.2738907,[-----GPS DATA-----],42.33879852294922,-71.08808898925781,14.800000190734863,327985.96875,4689505.5,19,T
1644449575.33653,[-----GPS DATA-----],42.33879852294922,-71.08808898925781,14.800000190734863,327985.96875,4689505.5,19,T
1644449576.2690628,[-----GPS DATA-----],42.33879852294922,-71.08808898925781,14.800000190734863,327985.96875,4689505.5,19,T
1644449577.2685854,[-----GPS DATA-----],42.33879852294922,-71.08808898925781,14.899999618530273,327985.96875,4689505.5,19,T
1644449578.2685874,[-----GPS DATA-----],42.33879852294922,-71.08808898925781,14.899999618530273,327985.96875,4689505.5,19,T
1644449579.2693374,[-----GPS DATA-----],42.33879852294922,-71.08808898925781,14.899999618530273,327985.96875,4689505.5,19,T
1644449580.33196,[-----GPS DATA-----],42.33879852294922,-71.08808898925781,14.899999618530273,327985.96875,4689505.5,19,T
1644449581.2686975,[-----GPS DATA-----],42.33879852294922,-71.08808898925781,14.899999618530273,327985.96875,4689505.5,19,T
1644449582.2683997,[-----GPS DATA-----],42.33879852294922,-71.08808898925781,15.0,327985.96875,4689505.5,19,T
1644449583.2691247,[-----GPS DATA-----],42.33879852294922,-71.08808898925781,15.0,327985.96875,4689505.5,19,T
1644449584.2695904,[-----GPS DATA-----],42.33879852294922,-71.08808898925781,15.0,327985.96875,4689505.5,19,T
1644449585.3352654,[-----GPS DATA-----],42.33879852294922,-71.08808898925781,15.0,327985.96875,4689505.5,19,T
1644449586.2692292,[-----GPS DATA-----],42.33879852294922,-71.08808898925781,15.0,327985.96875,4689505.5,19,T
1644449587.2671833,[-----GPS DATA-----],42.33879852294922,-71.08808898925781,15.0,327985.96875,4689505.5,19,T
1644449588.2661695,[-----GPS DATA-----],42.33879852294922,-71.08808898925781,15.100000381469727,327985.96875,4689505.5,19,T
1644449589.2657719,[-----GPS DATA-----],42.33879852294922,-71.08808898925781,15.100000381469727,327985.96875,4689505.5,19,T
1644449590.3225672,[-----GPS DATA-----],42.33879852294922,-71.08808898925781,15.100000381469727,327985.96875,4689505.5,19,T
1644449591.266973,[-----GPS DATA-----],42.33879852294922,-71.08808898925781,15.100000381469727,327985.96875,4689505.5,19,T
1644449592.2728577,[-----GPS DATA-----],42.33879852294922,-71.08808898925781,15.100000381469727,327985.96875,4689505.5,19,T
1644449593.2652447,[-----GPS DATA-----],42.33879852294922,-71.08808898925781,15.199999809265137,327985.96875,4689505.5,19,T
1644449594.2682893,[-----GPS DATA-----],42.33879852294922,-71.08808898925781,15.199999809265137,327985.96875,4689505.5,19,T
1644449595.3309414,[-----GPS DATA-----],42.33879852294922,-71.08808898925781,15.199999809265137,327985.96875,4689505.5,19,T
1644449596.2674534,[-----GPS DATA-----],42.33879852294922,-71.08809661865234,15.199999809265137,327985.8125,4689505.5,19,T
1644449597.2692392,[-----GPS DATA-----],42.33879852294922,-71.08809661865234,15.199999809265137,327985.8125,4689505.5,19,T
1644449598.3055885,[-----GPS DATA-----],42.33879852294922,-71.08809661865234,15.199999809265137,327985.8125,4689505.5,19,T
1644449599.2713122,[-----GPS DATA-----],42.33879852294922,-71.08809661865234,15.300000190734863,327985.8125,4689505.5,19,T
1644449600.3331308,[-----GPS DATA-----],42.33879852294922,-71.08809661865234,15.300000190734863,327985.8125,4689505.5,19,T
1644449601.2698166,[-----GPS DATA-----],42.33879852294922,-71.08809661865234,15.300000190734863,327985.8125,4689505.5,19,T
1644449602.268468,[-----GPS DATA-----],42.33879852294922,-71.08809661865234,15.300000190734863,327985.8125,4689505.5,19,T
1644449603.2695465,[-----GPS DATA-----],42.33879852294922,-71.08809661865234,15.300000190734863,327985.8125,4689505.5,19,T
1644449604.2660382,[-----GPS DATA-----],42.33879852294922,-71.08809661865234,15.300000190734863,327985.8125,4689505.5,19,T
1644449605.3290682,[-----GPS DATA-----],42.33879852294922,-71.08809661865234,15.300000190734863,327985.8125,4689505.5,19,T
1644449606.2692761,[-----GPS DATA-----],42.33879852294922,-71.08809661865234,15.300000190734863,327985.8125,4689505.5,19,T
1644449607.2698534,[-----GPS DATA-----],42.33879852294922,-71.08809661865234,15.399999618530273,327985.8125,4689505.5,19,T
1644449608.270327,[-----GPS DATA-----],42.33879852294922,-71.08809661865234,15.399999618530273,327985.8125,4689505.5,19,T
1644449609.272174,[-----GPS DATA-----],42.33879852294922,-71.08809661865234,15.399999618530273,327985.8125,4689505.5,19,T
1644449610.3334014,[-----GPS DATA-----],42.33879852294922,-71.08809661865234,15.399999618530273,327985.8125,4689505.5,19,T
1644449611.2873228,[-----GPS DATA-----],42.33879852294922,-71.08809661865234,15.399999618530273,327985.8125,4689505.5,19,T
1644449612.2680252,[-----GPS DATA-----],42.33879852294922,-71.08809661865234,15.399999618530273,327985.8125,4689505.5,19,T
1644449613.3054686,[-----GPS DATA-----],42.33879852294922,-71.08809661865234,15.399999618530273,327985.8125,4689505.5,19,T
1644449614.2695746,[-----GPS DATA-----],42.33879852294922,-71.08809661865234,15.399999618530273,327985.8125,4689505.5,19,T
1644449615.3355186,[-----GPS DATA-----],42.33879852294922,-71.08809661865234,15.399999618530273,327985.8125,4689505.5,19,T
1644449616.2696748,[-----GPS DATA-----],42.33879852294922,-71.08809661865234,15.399999618530273,327985.8125,4689505.5,19,T
1644449617.266438,[-----GPS DATA-----],42.33879852294922,-71.08809661865234,15.5,327985.8125,4689505.5,19,T
1644449618.2693212,[-----GPS DATA-----],42.33879852294922,-71.08809661865234,15.5,327985.8125,4689505.5,19,T
1644449619.264649,[-----GPS DATA-----],42.33879852294922,-71.08809661865234,15.5,327985.8125,4689505.5,19,T
1644449620.324522,[-----GPS DATA-----],42.33879852294922,-71.08809661865234,15.5,327985.8125,4689505.5,19,T
1644449621.2664998,[-----GPS DATA-----],42.33879852294922,-71.08809661865234,15.5,327985.8125,4689505.5,19,T
1644449622.3013232,[-----GPS DATA-----],42.33879852294922,-71.08809661865234,15.5,327985.8125,4689505.5,19,T
1644449623.2670681,[-----GPS DATA-----],42.33879852294922,-71.08809661865234,15.5,327985.8125,4689505.5,19,T
1644449624.3046613,[-----GPS DATA-----],42.33879852294922,-71.08809661865234,15.5,327985.8125,4689505.5,19,T
1644449625.3656483,[-----GPS DATA-----],42.33879852294922,-71.08809661865234,15.5,327985.8125,4689505.5,19,T
1644449626.267025,[-----GPS DATA-----],42.33879852294922,-71.08809661865234,15.5,327985.8125,4689505.5,19,T
1644449627.263528,[-----GPS DATA-----],42.33879852294922,-71.08809661865234,15.5,327985.8125,4689505.5,19,T
1644449628.2640593,[-----GPS DATA-----],42.33879852294922,-71.08809661865234,15.5,327985.8125,4689505.5,19,T
1644449629.2640116,[-----GPS DATA-----],42.33879852294922,-71.08809661865234,15.5,327985.8125,4689505.5,19,T
1644449630.3204463,[-----GPS DATA-----],42.33879852294922,-71.08809661865234,15.5,327985.8125,4689505.5,19,T
1644449631.2639356,[-----GPS DATA-----],42.33879852294922,-71.08809661865234,15.5,327985.8125,4689505.5,19,T
1644449632.2656837,[-----GPS DATA-----],42.33879852294922,-71.08809661865234,15.5,327985.8125,4689505.5,19,T
1644449633.2689188,[-----GPS DATA-----],42.33879852294922,-71.08809661865234,15.5,327985.8125,4689505.5,19,T
1644449634.2687204,[-----GPS DATA-----],42.33879852294922,-71.08809661865234,15.5,327985.8125,4689505.5,19,T
1644449635.33101,[-----GPS DATA-----],42.33879852294922,-71.08809661865234,15.600000381469727,327985.8125,4689505.5,19,T
1644449636.2685404,[-----GPS DATA-----],42.33879852294922,-71.08809661865234,15.600000381469727,327985.8125,4689505.5,19,T
1644449637.2649612,[-----GPS DATA-----],42.33879852294922,-71.08809661865234,15.600000381469727,327985.8125,4689505.5,19,T
1644449638.2657793,[-----GPS DATA-----],42.33879852294922,-71.08809661865234,15.600000381469727,327985.8125,4689505.5,19,T
1644449639.2654512,[-----GPS DATA-----],42.33879852294922,-71.08809661865234,15.600000381469727,327985.8125,4689505.5,19,T
1644449640.3251631,[-----GPS DATA-----],42.33879852294922,-71.08809661865234,15.600000381469727,327985.8125,4689505.5,19,T
1644449641.268251,[-----GPS DATA-----],42.33879852294922,-71.08809661865234,15.600000381469727,327985.8125,4689505.5,19,T
1644449642.2682111,[-----GPS DATA-----],42.33879852294922,-71.08809661865234,15.600000381469727,327985.8125,4689505.5,19,T
1644449643.265815,[-----GPS DATA-----],42.33879852294922,-71.08809661865234,15.600000381469727,327985.8125,4689505.5,19,T
1644449644.265546,[-----GPS DATA-----],42.33879852294922,-71.08809661865234,15.600000381469727,327985.8125,4689505.5,19,T
1644449645.3271453,[-----GPS DATA-----],42.33879852294922,-71.08809661865234,15.600000381469727,327985.8125,4689505.5,19,T
1644449646.2718391,[-----GPS DATA-----],42.33879852294922,-71.08809661865234,15.600000381469727,327985.8125,4689505.5,19,T
1644449647.2685723,[-----GPS DATA-----],42.33879852294922,-71.08809661865234,15.600000381469727,327985.8125,4689505.5,19,T
1644449648.305617,[-----GPS DATA-----],42.33879852294922,-71.08809661865234,15.600000381469727,327985.8125,4689505.5,19,T
1644449649.2687492,[-----GPS DATA-----],42.33879852294922,-71.08809661865234,15.600000381469727,327985.8125,4689505.5,19,T
1644449650.3299875,[-----GPS DATA-----],42.33879852294922,-71.08809661865234,15.600000381469727,327985.8125,4689505.5,19,T
1644449651.2644553,[-----GPS DATA-----],42.33879852294922,-71.08809661865234,15.600000381469727,327985.8125,4689505.5,19,T
1644449652.267851,[-----GPS DATA-----],42.33879852294922,-71.08809661865234,15.600000381469727,327985.8125,4689505.5,19,T
1644449653.2657874,[-----GPS DATA-----],42.33879852294922,-71.08809661865234,15.600000381469727,327985.8125,4689505.5,19,T
1644449654.26537,[-----GPS DATA-----],42.33879852294922,-71.08809661865234,15.600000381469727,327985.8125,4689505.5,19,T
1644449655.3259566,[-----GPS DATA-----],42.33879852294922,-71.08809661865234,15.600000381469727,327985.8125,4689505.5,19,T
1644449656.2663112,[-----GPS DATA-----],42.338802337646484,-71.08809661865234,15.600000381469727,327985.8125,4689505.5,19,T
1644449657.270095,[-----GPS DATA-----],42.338802337646484,-71.08809661865234,15.600000381469727,327985.8125,4689505.5,19,T
1644449658.2679257,[-----GPS DATA-----],42.338802337646484,-71.08809661865234,15.699999809265137,327985.8125,4689505.5,19,T
1644449659.2670867,[-----GPS DATA-----],42.338802337646484,-71.08809661865234,15.699999809265137,327985.8125,4689505.5,19,T
1644449660.3291852,[-----GPS DATA-----],42.338802337646484,-71.08809661865234,15.699999809265137,327985.8125,4689505.5,19,T
1644449661.2660887,[-----GPS DATA-----],42.338802337646484,-71.08809661865234,15.699999809265137,327985.8125,4689505.5,19,T
1644449662.2636328,[-----GPS DATA-----],42.338802337646484,-71.08809661865234,15.699999809265137,327985.8125,4689505.5,19,T
1644449663.300932,[-----GPS DATA-----],42.338802337646484,-71.08809661865234,15.699999809265137,327985.8125,4689505.5,19,T
1644449664.26393,[-----GPS DATA-----],42.338802337646484,-71.08809661865234,15.699999809265137,327985.8125,4689505.5,19,T
1644449665.3204021,[-----GPS DATA-----],42.338802337646484,-71.08809661865234,15.699999809265137,327985.8125,4689505.5,19,T
1644449666.264223,[-----GPS DATA-----],42.338802337646484,-71.08809661865234,15.699999809265137,327985.8125,4689505.5,19,T
1644449667.2648382,[-----GPS DATA-----],42.338802337646484,-71.08809661865234,15.699999809265137,327985.8125,4689505.5,19,T
1644449668.2624662,[-----GPS DATA-----],42.338802337646484,-71.08809661865234,15.699999809265137,327985.8125,4689505.5,19,T
1644449669.262294,[-----GPS DATA-----],42.338802337646484,-71.08809661865234,15.699999809265137,327985.8125,4689505.5,19,T
1644449670.318866,[-----GPS DATA-----],42.338802337646484,-71.08809661865234,15.699999809265137,327985.8125,4689505.5,19,T
1644449671.2637358,[-----GPS DATA-----],42.338802337646484,-71.08809661865234,15.699999809265137,327985.8125,4689505.5,19,T
1644449672.3002577,[-----GPS DATA-----],42.338802337646484,-71.08809661865234,15.699999809265137,327985.6875,4689506.0,19,T
1644449673.2628937,[-----GPS DATA-----],42.338802337646484,-71.08809661865234,15.699999809265137,327985.6875,4689506.0,19,T
1644449674.2631767,[-----GPS DATA-----],42.338802337646484,-71.08809661865234,15.699999809265137,327985.6875,4689506.0,19,T
1644449675.3195188,[-----GPS DATA-----],42.338802337646484,-71.08809661865234,15.699999809265137,327985.6875,4689506.0,19,T
1644449676.267236,[-----GPS DATA-----],42.338802337646484,-71.08809661865234,15.800000190734863,327985.6875,4689506.0,19,T
1644449677.2642617,[-----GPS DATA-----],42.338802337646484,-71.08809661865234,15.800000190734863,327985.6875,4689506.0,19,T
1644449678.2631874,[-----GPS DATA-----],42.338802337646484,-71.08809661865234,15.800000190734863,327985.6875,4689506.0,19,T
1644449679.26265,[-----GPS DATA-----],42.338802337646484,-71.08809661865234,15.800000190734863,327985.6875,4689506.0,19,T
1644449680.318918,[-----GPS DATA-----],42.338802337646484,-71.08809661865234,15.800000190734863,327985.6875,4689506.0,19,T
1644449681.2627082,[-----GPS DATA-----],42.338802337646484,-71.08809661865234,15.800000190734863,327985.6875,4689506.0,19,T
1644449682.263469,[-----GPS DATA-----],42.338802337646484,-71.08809661865234,15.800000190734863,327985.6875,4689506.0,19,T
1644449683.2635405,[-----GPS DATA-----],42.338802337646484,-71.08809661865234,15.800000190734863,327985.6875,4689506.0,19,T
1644449684.2643569,[-----GPS DATA-----],42.338802337646484,-71.08809661865234,15.800000190734863,327985.84375,4689506.0,19,T
1644449685.3222723,[-----GPS DATA-----],42.338802337646484,-71.08809661865234,15.800000190734863,327985.84375,4689506.0,19,T
1644449686.2634208,[-----GPS DATA-----],42.338802337646484,-71.08809661865234,15.800000190734863,327985.84375,4689506.0,19,T
1644449687.2643316,[-----GPS DATA-----],42.338802337646484,-71.08809661865234,15.800000190734863,327985.84375,4689506.0,19,T
1644449688.2646935,[-----GPS DATA-----],42.338802337646484,-71.08809661865234,15.800000190734863,327985.84375,4689506.0,19,T
1644449689.2644923,[-----GPS DATA-----],42.338802337646484,-71.08809661865234,15.800000190734863,327985.84375,4689506.0,19,T
1644449690.3218713,[-----GPS DATA-----],42.338802337646484,-71.08809661865234,15.800000190734863,327985.84375,4689506.0,19,T
1644449691.2628074,[-----GPS DATA-----],42.338802337646484,-71.08809661865234,15.800000190734863,327985.84375,4689506.0,19,T
1644449692.2649093,[-----GPS DATA-----],42.338802337646484,-71.08809661865234,15.800000190734863,327985.84375,4689506.0,19,T
1644449693.2639635,[-----GPS DATA-----],42.338802337646484,-71.08809661865234,15.800000190734863,327985.84375,4689506.0,19,T
1644449694.2647398,[-----GPS DATA-----],42.338802337646484,-71.08809661865234,15.800000190734863,327985.84375,4689506.0,19,T
1644449695.3214266,[-----GPS DATA-----],42.338802337646484,-71.08809661865234,15.800000190734863,327985.84375,4689506.0,19,T
1644449696.2653234,[-----GPS DATA-----],42.338802337646484,-71.08809661865234,15.800000190734863,327985.84375,4689506.0,19,T
1644449697.2661657,[-----GPS DATA-----],42.338802337646484,-71.08809661865234,15.800000190734863,327985.84375,4689506.0,19,T
1644449698.265999,[-----GPS DATA-----],42.338802337646484,-71.08809661865234,15.800000190734863,327985.84375,4689506.0,19,T
1644449699.30249,[-----GPS DATA-----],42.338802337646484,-71.08809661865234,15.800000190734863,327985.84375,4689506.0,19,T
1644449700.3587365,[-----GPS DATA-----],42.338802337646484,-71.08809661865234,15.800000190734863,327985.84375,4689506.0,19,T
1644449701.2662492,[-----GPS DATA-----],42.338802337646484,-71.08809661865234,15.899999618530273,327985.84375,4689506.0,19,T
1644449702.26645,[-----GPS DATA-----],42.338802337646484,-71.08809661865234,15.899999618530273,327985.84375,4689506.0,19,T
1644449703.266369,[-----GPS DATA-----],42.33880615234375,-71.08809661865234,15.899999618530273,327985.84375,4689506.0,19,T
1644449704.2659326,[-----GPS DATA-----],42.33880615234375,-71.08809661865234,15.899999618530273,327985.84375,4689506.0,19,T
1644449705.3220348,[-----GPS DATA-----],42.33880615234375,-71.08809661865234,15.899999618530273,327985.6875,4689506.0,19,T
1644449706.2662683,[-----GPS DATA-----],42.33880615234375,-71.08809661865234,15.899999618530273,327985.84375,4689506.0,19,T
1644449707.266358,[-----GPS DATA-----],42.33880615234375,-71.08809661865234,15.899999618530273,327985.84375,4689506.0,19,T
1644449708.266317,[-----GPS DATA-----],42.33880615234375,-71.08809661865234,15.899999618530273,327985.84375,4689506.0,19,T
1644449709.266392,[-----GPS DATA-----],42.33880615234375,-71.08809661865234,15.899999618530273,327985.84375,4689506.0,19,T
1644449710.3229678,[-----GPS DATA-----],42.33880615234375,-71.08809661865234,15.899999618530273,327985.6875,4689506.0,19,T
1644449711.2659838,[-----GPS DATA-----],42.33880615234375,-71.08809661865234,15.899999618530273,327985.6875,4689506.0,19,T
1644449712.2670078,[-----GPS DATA-----],42.33880615234375,-71.08809661865234,15.899999618530273,327985.6875,4689506.0,19,T
1644449713.265852,[-----GPS DATA-----],42.33880615234375,-71.08809661865234,15.899999618530273,327985.6875,4689506.0,19,T
1644449714.3021593,[-----GPS DATA-----],42.33880615234375,-71.08809661865234,15.899999618530273,327985.6875,4689506.0,19,T
1644449715.3581367,[-----GPS DATA-----],42.33880615234375,-71.08809661865234,15.899999618530273,327985.6875,4689506.0,19,T
1644449716.2654176,[-----GPS DATA-----],42.33880615234375,-71.08809661865234,15.899999618530273,327985.6875,4689506.0,19,T
1644449717.264929,[-----GPS DATA-----],42.33880615234375,-71.08809661865234,15.899999618530273,327985.71875,4689506.0,19,T
1644449718.2655056,[-----GPS DATA-----],42.33880615234375,-71.08809661865234,15.899999618530273,327985.71875,4689506.0,19,T
1644449719.2661607,[-----GPS DATA-----],42.33880615234375,-71.08809661865234,15.899999618530273,327985.71875,4689506.0,19,T
1644449720.3229697,[-----GPS DATA-----],42.33880615234375,-71.08809661865234,15.899999618530273,327985.71875,4689506.0,19,T
1644449721.2652924,[-----GPS DATA-----],42.33880615234375,-71.08809661865234,15.899999618530273,327985.71875,4689506.0,19,T
1644449722.3024817,[-----GPS DATA-----],42.33880615234375,-71.08809661865234,15.899999618530273,327985.71875,4689506.0,19,T
1644449723.2660944,[-----GPS DATA-----],42.338809967041016,-71.08809661865234,16.0,327985.71875,4689506.5,19,T
1644449724.2655005,[-----GPS DATA-----],42.338809967041016,-71.08809661865234,16.0,327985.71875,4689506.5,19,T
1644449725.3218524,[-----GPS DATA-----],42.338809967041016,-71.08809661865234,16.0,327985.71875,4689506.5,19,T
1644449726.2659152,[-----GPS DATA-----],42.338809967041016,-71.08809661865234,16.0,327985.71875,4689506.5,19,T
1644449727.265366,[-----GPS DATA-----],42.338809967041016,-71.08809661865234,16.0,327985.71875,4689506.5,19,T
1644449728.2660537,[-----GPS DATA-----],42.338809967041016,-71.08809661865234,16.0,327985.71875,4689506.5,19,T
1644449729.2653615,[-----GPS DATA-----],42.338809967041016,-71.08809661865234,16.0,327985.71875,4689506.5,19,T
1644449730.3213012,[-----GPS DATA-----],42.338809967041016,-71.08809661865234,16.0,327985.71875,4689506.5,19,T
1644449731.2663333,[-----GPS DATA-----],42.338809967041016,-71.08809661865234,16.0,327985.71875,4689506.5,19,T
1644449732.2657833,[-----GPS DATA-----],42.338809967041016,-71.08809661865234,16.0,327985.71875,4689506.5,19,T
1644449733.2667537,[-----GPS DATA-----],42.338809967041016,-71.08809661865234,16.0,327985.71875,4689506.5,19,T
1644449734.266033,[-----GPS DATA-----],42.338809967041016,-71.08809661865234,16.0,327985.71875,4689506.5,19,T
1644449735.3224645,[-----GPS DATA-----],42.338809967041016,-71.08809661865234,16.0,327985.71875,4689506.5,19,T
1644449736.2656994,[-----GPS DATA-----],42.338809967041016,-71.08809661865234,16.0,327985.71875,4689506.5,19,T
1644449737.2663121,[-----GPS DATA-----],42.338809967041016,-71.08809661865234,16.0,327985.71875,4689506.5,19,T
1644449738.2655382,[-----GPS DATA-----],42.338809967041016,-71.08809661865234,16.0,327985.71875,4689506.5,19,T
1644449739.2695549,[-----GPS DATA-----],42.338809967041016,-71.08809661865234,16.0,327985.71875,4689506.5,19,T
1644449740.3258507,[-----GPS DATA-----],42.338809967041016,-71.08809661865234,16.0,327985.71875,4689506.5,19,T
1644449741.2654123,[-----GPS DATA-----],42.338809967041016,-71.08809661865234,16.0,327985.71875,4689506.5,19,T
1644449742.2665825,[-----GPS DATA-----],42.338809967041016,-71.08809661865234,16.0,327985.71875,4689506.5,19,T
1644449743.267894,[-----GPS DATA-----],42.338809967041016,-71.08809661865234,16.0,327985.71875,4689506.5,19,T
1644449744.2674665,[-----GPS DATA-----],42.338809967041016,-71.08809661865234,16.0,327985.71875,4689506.5,19,T
1644449745.3240204,[-----GPS DATA-----],42.338809967041016,-71.08809661865234,16.0,327985.71875,4689506.5,19,T
1644449746.2636845,[-----GPS DATA-----],42.338809967041016,-71.08809661865234,16.100000381469727,327985.71875,4689506.5,19,T
1644449747.263042,[-----GPS DATA-----],42.338809967041016,-71.08809661865234,16.100000381469727,327985.71875,4689506.5,19,T
1644449748.26304,[-----GPS DATA-----],42.338809967041016,-71.08809661865234,16.100000381469727,327985.71875,4689506.5,19,T
1644449749.2641711,[-----GPS DATA-----],42.338809967041016,-71.08809661865234,16.100000381469727,327985.71875,4689506.5,19,T
1644449750.320989,[-----GPS DATA-----],42.338809967041016,-71.08809661865234,16.100000381469727,327985.71875,4689506.5,19,T
1644449751.2640672,[-----GPS DATA-----],42.338809967041016,-71.08809661865234,16.100000381469727,327985.71875,4689506.5,19,T
1644449752.265089,[-----GPS DATA-----],42.338809967041016,-71.08809661865234,16.100000381469727,327985.71875,4689506.5,19,T
1644449753.26372,[-----GPS DATA-----],42.338809967041016,-71.08809661865234,16.100000381469727,327985.71875,4689506.5,19,T
1644449754.2642834,[-----GPS DATA-----],42.338809967041016,-71.08809661865234,16.100000381469727,327985.71875,4689506.5,19,T
1644449755.3209507,[-----GPS DATA-----],42.338809967041016,-71.08809661865234,16.100000381469727,327985.71875,4689506.5,19,T
1644449756.2639396,[-----GPS DATA-----],42.338809967041016,-71.08809661865234,16.100000381469727,327985.71875,4689506.5,19,T
1644449757.2632291,[-----GPS DATA-----],42.338809967041016,-71.08809661865234,16.100000381469727,327985.71875,4689506.5,19,T
1644449758.2648547,[-----GPS DATA-----],42.338809967041016,-71.08809661865234,16.100000381469727,327985.71875,4689506.5,19,T
1644449759.266173,[-----GPS DATA-----],42.338809967041016,-71.08809661865234,16.100000381469727,327985.71875,4689506.5,19,T
1644449760.322648,[-----GPS DATA-----],42.338809967041016,-71.08809661865234,16.100000381469727,327985.71875,4689506.5,19,T
1644449761.2662692,[-----GPS DATA-----],42.338809967041016,-71.08809661865234,16.100000381469727,327985.71875,4689506.5,19,T
1644449762.26659,[-----GPS DATA-----],42.338809967041016,-71.08809661865234,16.100000381469727,327985.71875,4689506.5,19,T
1644449763.2668653,[-----GPS DATA-----],42.338809967041016,-71.08809661865234,16.200000762939453,327985.71875,4689506.5,19,T
1644449764.302906,[-----GPS DATA-----],42.338809967041016,-71.08809661865234,16.200000762939453,327985.71875,4689506.5,19,T
1644449765.3594248,[-----GPS DATA-----],42.338809967041016,-71.08809661865234,16.200000762939453,327985.71875,4689506.5,19,T
1644449766.266945,[-----GPS DATA-----],42.338809967041016,-71.08809661865234,16.200000762939453,327985.71875,4689506.5,19,T
1644449767.2665205,[-----GPS DATA-----],42.338809967041016,-71.08809661865234,16.200000762939453,327985.71875,4689506.5,19,T
1644449768.266174,[-----GPS DATA-----],42.338809967041016,-71.08809661865234,16.200000762939453,327985.71875,4689506.5,19,T
1644449769.2662375,[-----GPS DATA-----],42.338809967041016,-71.08809661865234,16.200000762939453,327985.71875,4689506.5,19,T
1644449770.322627,[-----GPS DATA-----],42.338809967041016,-71.08809661865234,16.200000762939453,327985.71875,4689506.5,19,T
1644449771.266547,[-----GPS DATA-----],42.338809967041016,-71.08809661865234,16.299999237060547,327985.71875,4689506.5,19,T
1644449772.265087,[-----GPS DATA-----],42.338809967041016,-71.08809661865234,16.299999237060547,327985.71875,4689506.5,19,T
1644449773.3091743,[-----GPS DATA-----],42.33880615234375,-71.08809661865234,16.299999237060547,327985.71875,4689506.0,19,T
1644449774.2666125,[-----GPS DATA-----],42.33880615234375,-71.08809661865234,16.299999237060547,327985.71875,4689506.0,19,T
1644449775.324952,[-----GPS DATA-----],42.33880615234375,-71.08809661865234,16.299999237060547,327985.71875,4689506.0,19,T
1644449776.3033545,[-----GPS DATA-----],42.33880615234375,-71.08809661865234,16.299999237060547,327985.71875,4689506.0,19,T
1644449777.266304,[-----GPS DATA-----],42.33880615234375,-71.08809661865234,16.299999237060547,327985.71875,4689506.0,19,T
1644449778.2667136,[-----GPS DATA-----],42.33880615234375,-71.08809661865234,16.399999618530273,327985.71875,4689506.0,19,T
1644449779.2668035,[-----GPS DATA-----],42.33880615234375,-71.08809661865234,16.399999618530273,327985.71875,4689506.0,19,T
1644449780.3233275,[-----GPS DATA-----],42.33880615234375,-71.08809661865234,16.399999618530273,327985.71875,4689506.0,19,T
1644449781.2655175,[-----GPS DATA-----],42.33880615234375,-71.08809661865234,16.399999618530273,327985.71875,4689506.0,19,T
1644449782.2699351,[-----GPS DATA-----],42.33880615234375,-71.08809661865234,16.399999618530273,327985.71875,4689506.0,19,T
1644449783.2654152,[-----GPS DATA-----],42.33880615234375,-71.08809661865234,16.399999618530273,327985.71875,4689506.0,19,T
1644449784.2664938,[-----GPS DATA-----],42.33880615234375,-71.08809661865234,16.399999618530273,327985.71875,4689506.0,19,T
1644449785.3228517,[-----GPS DATA-----],42.33880615234375,-71.08809661865234,16.5,327985.71875,4689506.0,19,T
1644449786.2663724,[-----GPS DATA-----],42.33880615234375,-71.08809661865234,16.5,327985.71875,4689506.0,19,T
1644449787.2656615,[-----GPS DATA-----],42.33880615234375,-71.08809661865234,16.5,327985.71875,4689506.0,19,T
1644449788.2633948,[-----GPS DATA-----],42.33880615234375,-71.08809661865234,16.5,327985.71875,4689506.0,19,T
1644449789.263774,[-----GPS DATA-----],42.33880615234375,-71.08809661865234,16.5,327985.71875,4689506.0,19,T
1644449790.3202782,[-----GPS DATA-----],42.33880615234375,-71.08809661865234,16.5,327985.71875,4689506.0,19,T
1644449791.2699025,[-----GPS DATA-----],42.33880615234375,-71.08809661865234,16.5,327985.71875,4689506.0,19,T
1644449792.2651553,[-----GPS DATA-----],42.33880615234375,-71.08809661865234,16.600000381469727,327985.71875,4689506.0,19,T
1644449793.2654839,[-----GPS DATA-----],42.33880615234375,-71.08809661865234,16.600000381469727,327985.71875,4689506.0,19,T
1644449794.2656553,[-----GPS DATA-----],42.33880615234375,-71.08809661865234,16.600000381469727,327985.71875,4689506.0,19,T
1644449795.3219821,[-----GPS DATA-----],42.33880615234375,-71.08809661865234,16.600000381469727,327985.71875,4689506.0,19,T
1644449796.265941,[-----GPS DATA-----],42.33880615234375,-71.08809661865234,16.600000381469727,327985.71875,4689506.0,19,T
1644449797.2664247,[-----GPS DATA-----],42.33880615234375,-71.08809661865234,16.600000381469727,327985.71875,4689506.0,19,T
1644449798.2661166,[-----GPS DATA-----],42.33880615234375,-71.08809661865234,16.600000381469727,327985.71875,4689506.0,19,T
1644449799.2658193,[-----GPS DATA-----],42.33880615234375,-71.08809661865234,16.700000762939453,327985.71875,4689506.0,19,T
1644449800.3224597,[-----GPS DATA-----],42.33880615234375,-71.08809661865234,16.700000762939453,327985.71875,4689506.0,19,T
1644449801.3024862,[-----GPS DATA-----],42.33880615234375,-71.08809661865234,16.700000762939453,327985.71875,4689506.0,19,T
1644449802.2676742,[-----GPS DATA-----],42.33880615234375,-71.08809661865234,16.700000762939453,327985.71875,4689506.0,19,T
1644449803.2667851,[-----GPS DATA-----],42.33880615234375,-71.08809661865234,16.700000762939453,327985.6875,4689506.0,19,T
1644449804.2662675,[-----GPS DATA-----],42.33880615234375,-71.08809661865234,16.700000762939453,327985.6875,4689506.0,19,T
1644449805.322806,[-----GPS DATA-----],42.33880615234375,-71.08809661865234,16.700000762939453,327985.6875,4689506.0,19,T
1644449806.2657938,[-----GPS DATA-----],42.33880615234375,-71.08809661865234,16.799999237060547,327985.6875,4689506.0,19,T
1644449807.2657118,[-----GPS DATA-----],42.33880615234375,-71.08809661865234,16.799999237060547,327985.6875,4689506.0,19,T
1644449808.2655606,[-----GPS DATA-----],42.33880615234375,-71.08809661865234,16.799999237060547,327985.6875,4689506.0,19,T
1644449809.266045,[-----GPS DATA-----],42.33880615234375,-71.08809661865234,16.799999237060547,327985.6875,4689506.0,19,T
1644449810.3226695,[-----GPS DATA-----],42.33880615234375,-71.08809661865234,16.799999237060547,327985.6875,4689506.0,19,T
1644449811.2649837,[-----GPS DATA-----],42.33880615234375,-71.08809661865234,16.799999237060547,327985.6875,4689506.0,19,T
1644449812.2644932,[-----GPS DATA-----],42.33880615234375,-71.08809661865234,16.799999237060547,327985.6875,4689506.0,19,T
1644449813.2671816,[-----GPS DATA-----],42.33880615234375,-71.08809661865234,16.799999237060547,327985.71875,4689506.0,19,T
1644449814.2651188,[-----GPS DATA-----],42.33880615234375,-71.08809661865234,16.899999618530273,327985.6875,4689506.0,19,T
1644449815.321704,[-----GPS DATA-----],42.33880615234375,-71.08809661865234,16.899999618530273,327985.71875,4689506.0,19,T
1644449816.264784,[-----GPS DATA-----],42.33880615234375,-71.08809661865234,16.899999618530273,327985.71875,4689506.0,19,T
1644449817.2663534,[-----GPS DATA-----],42.33880615234375,-71.08809661865234,16.899999618530273,327985.71875,4689506.0,19,T
1644449818.2660413,[-----GPS DATA-----],42.33880615234375,-71.08809661865234,16.899999618530273,327985.5625,4689506.0,19,T
1644449819.2649727,[-----GPS DATA-----],42.33880615234375,-71.08809661865234,16.899999618530273,327985.5625,4689506.0,19,T
1644449820.321413,[-----GPS DATA-----],42.33880615234375,-71.08809661865234,16.899999618530273,327985.5625,4689506.0,19,T
1644449821.2662103,[-----GPS DATA-----],42.33880615234375,-71.08809661865234,17.0,327985.5625,4689506.0,19,T
1644449822.2632504,[-----GPS DATA-----],42.33880615234375,-71.08809661865234,17.0,327985.5625,4689506.0,19,T
1644449823.2626953,[-----GPS DATA-----],42.33880615234375,-71.08809661865234,17.0,327985.5625,4689506.0,19,T
1644449824.299529,[-----GPS DATA-----],42.33880615234375,-71.08809661865234,17.0,327985.5625,4689506.0,19,T
1644449825.3557956,[-----GPS DATA-----],42.33880615234375,-71.08809661865234,17.0,327985.5625,4689506.0,19,T
1644449826.263779,[-----GPS DATA-----],42.33880615234375,-71.08809661865234,17.0,327985.5625,4689506.0,19,T
1644449827.3007066,[-----GPS DATA-----],42.33880615234375,-71.08809661865234,17.0,327985.5625,4689506.0,19,T
1644449828.264798,[-----GPS DATA-----],42.33880615234375,-71.08809661865234,17.0,327985.5625,4689506.0,19,T
1644449829.265474,[-----GPS DATA-----],42.33880615234375,-71.08809661865234,17.0,327985.5625,4689506.0,19,T
1644449830.322011,[-----GPS DATA-----],42.33880615234375,-71.08809661865234,17.0,327985.5625,4689506.0,19,T
1644449831.2647316,[-----GPS DATA-----],42.33880615234375,-71.08809661865234,17.100000381469727,327985.5625,4689506.0,19,T
1644449832.2648182,[-----GPS DATA-----],42.33880615234375,-71.08809661865234,17.100000381469727,327985.5625,4689506.0,19,T
1644449833.2650254,[-----GPS DATA-----],42.33880615234375,-71.08809661865234,17.100000381469727,327985.5625,4689506.0,19,T
1644449834.264953,[-----GPS DATA-----],42.33880615234375,-71.08809661865234,17.100000381469727,327985.5625,4689506.0,19,T
1644449835.3213596,[-----GPS DATA-----],42.33880615234375,-71.08809661865234,17.100000381469727,327985.5625,4689506.0,19,T
1644449836.2649255,[-----GPS DATA-----],42.33880615234375,-71.08809661865234,17.100000381469727,327985.5625,4689506.0,19,T
1644449837.2645879,[-----GPS DATA-----],42.33880615234375,-71.08809661865234,17.100000381469727,327985.5625,4689506.0,19,T
1644449838.2650485,[-----GPS DATA-----],42.338809967041016,-71.08809661865234,17.100000381469727,327985.5625,4689506.5,19,T
1644449839.2645197,[-----GPS DATA-----],42.338809967041016,-71.08809661865234,17.100000381469727,327985.5625,4689506.5,19,T
1644449840.3255868,[-----GPS DATA-----],42.338809967041016,-71.08809661865234,17.100000381469727,327985.5625,4689506.5,19,T
1644449841.264756,[-----GPS DATA-----],42.338809967041016,-71.08809661865234,17.100000381469727,327985.5625,4689506.5,19,T
1644449842.265872,[-----GPS DATA-----],42.338809967041016,-71.08809661865234,17.100000381469727,327985.5625,4689506.5,19,T
1644449843.2647803,[-----GPS DATA-----],42.338809967041016,-71.08809661865234,17.100000381469727,327985.5625,4689506.5,19,T
1644449844.2652261,[-----GPS DATA-----],42.338809967041016,-71.08809661865234,17.100000381469727,327985.5625,4689506.5,19,T
1644449845.3228438,[-----GPS DATA-----],42.338809967041016,-71.08809661865234,17.100000381469727,327985.5625,4689506.5,19,T
1644449846.2641497,[-----GPS DATA-----],42.338809967041016,-71.08809661865234,17.100000381469727,327985.5625,4689506.5,19,T
1644449847.2660258,[-----GPS DATA-----],42.338809967041016,-71.08809661865234,17.100000381469727,327985.5625,4689506.5,19,T
1644449848.264857,[-----GPS DATA-----],42.338809967041016,-71.08809661865234,17.100000381469727,327985.5625,4689506.5,19,T
1644449849.2648144,[-----GPS DATA-----],42.338809967041016,-71.08809661865234,17.100000381469727,327985.5625,4689506.5,19,T
1644449850.3255324,[-----GPS DATA-----],42.338809967041016,-71.08809661865234,17.100000381469727,327985.5625,4689506.5,19,T
1644449851.3019695,[-----GPS DATA-----],42.338809967041016,-71.08809661865234,17.100000381469727,327985.5625,4689506.5,19,T
1644449852.264693,[-----GPS DATA-----],42.338809967041016,-71.08809661865234,17.100000381469727,327985.5625,4689506.5,19,T
1644449853.2647688,[-----GPS DATA-----],42.338809967041016,-71.08809661865234,17.100000381469727,327985.5625,4689506.5,19,T
1644449854.2647011,[-----GPS DATA-----],42.338809967041016,-71.08809661865234,17.200000762939453,327985.5625,4689506.5,19,T
1644449855.321502,[-----GPS DATA-----],42.338809967041016,-71.08809661865234,17.200000762939453,327985.5625,4689506.5,19,T
1644449856.2651484,[-----GPS DATA-----],42.338809967041016,-71.08809661865234,17.200000762939453,327985.5625,4689506.5,19,T
1644449857.264712,[-----GPS DATA-----],42.338809967041016,-71.08809661865234,17.200000762939453,327985.5625,4689506.5,19,T
1644449858.264983,[-----GPS DATA-----],42.338809967041016,-71.08809661865234,17.200000762939453,327985.5625,4689506.5,19,T
1644449859.264545,[-----GPS DATA-----],42.338809967041016,-71.08809661865234,17.200000762939453,327985.5625,4689506.5,19,T
1644449860.321033,[-----GPS DATA-----],42.338809967041016,-71.08809661865234,17.200000762939453,327985.5625,4689506.5,19,T
1644449861.2643487,[-----GPS DATA-----],42.338809967041016,-71.08809661865234,17.200000762939453,327985.5625,4689506.5,19,T
1644449862.2658348,[-----GPS DATA-----],42.338809967041016,-71.08809661865234,17.200000762939453,327985.5625,4689506.5,19,T
1644449863.2649891,[-----GPS DATA-----],42.338809967041016,-71.08809661865234,17.200000762939453,327985.5625,4689506.5,19,T
1644449864.269325,[-----GPS DATA-----],42.338809967041016,-71.08809661865234,17.200000762939453,327985.5625,4689506.5,19,T
1644449865.3256977,[-----GPS DATA-----],42.338809967041016,-71.08809661865234,17.200000762939453,327985.5625,4689506.5,19,T
1644449866.2653008,[-----GPS DATA-----],42.338809967041016,-71.08809661865234,17.200000762939453,327985.5625,4689506.5,19,T
1644449867.2658205,[-----GPS DATA-----],42.338809967041016,-71.08809661865234,17.200000762939453,327985.5625,4689506.5,19,T
1644449868.2654393,[-----GPS DATA-----],42.338809967041016,-71.08809661865234,17.200000762939453,327985.5625,4689506.5,19,T
1644449869.2659314,[-----GPS DATA-----],42.338809967041016,-71.08809661865234,17.200000762939453,327985.5625,4689506.5,19,T
1644449870.3230827,[-----GPS DATA-----],42.338809967041016,-71.08809661865234,17.200000762939453,327985.5625,4689506.5,19,T
1644449871.2673688,[-----GPS DATA-----],42.338809967041016,-71.08809661865234,17.200000762939453,327985.5625,4689506.5,19,T
1644449872.2652662,[-----GPS DATA-----],42.338809967041016,-71.08809661865234,17.200000762939453,327985.5625,4689506.5,19,T
1644449873.302759,[-----GPS DATA-----],42.338809967041016,-71.08809661865234,17.200000762939453,327985.5625,4689506.5,19,T
1644449874.2655172,[-----GPS DATA-----],42.338809967041016,-71.08809661865234,17.200000762939453,327985.5625,4689506.5,19,T
1644449875.3218122,[-----GPS DATA-----],42.338809967041016,-71.08809661865234,17.200000762939453,327985.5625,4689506.5,19,T
1644449876.2652197,[-----GPS DATA-----],42.338809967041016,-71.08809661865234,17.200000762939453,327985.5625,4689506.5,19,T
1644449877.26615,[-----GPS DATA-----],42.338809967041016,-71.08809661865234,17.200000762939453,327985.5625,4689506.5,19,T
1644449878.301932,[-----GPS DATA-----],42.338809967041016,-71.08809661865234,17.299999237060547,327985.5625,4689506.5,19,T
1644449879.3017302,[-----GPS DATA-----],42.338809967041016,-71.08809661865234,17.299999237060547,327985.5625,4689506.5,19,T
1644449880.3578503,[-----GPS DATA-----],42.338809967041016,-71.08809661865234,17.299999237060547,327985.5625,4689506.5,19,T
1644449881.2652905,[-----GPS DATA-----],42.338809967041016,-71.08809661865234,17.299999237060547,327985.5625,4689506.5,19,T
1644449882.2652464,[-----GPS DATA-----],42.338809967041016,-71.08809661865234,17.299999237060547,327985.5625,4689506.5,19,T
1644449883.2653148,[-----GPS DATA-----],42.338809967041016,-71.08809661865234,17.299999237060547,327985.5625,4689506.5,19,T
1644449884.2648745,[-----GPS DATA-----],42.338809967041016,-71.08809661865234,17.299999237060547,327985.5625,4689506.5,19,T
1644449885.3206568,[-----GPS DATA-----],42.338809967041016,-71.08809661865234,17.299999237060547,327985.5625,4689506.5,19,T
1644449886.2667537,[-----GPS DATA-----],42.338809967041016,-71.08809661865234,17.299999237060547,327985.5625,4689506.5,19,T
1644449887.2648063,[-----GPS DATA-----],42.338809967041016,-71.08809661865234,17.299999237060547,327985.5625,4689506.5,19,T
1644449888.2625358,[-----GPS DATA-----],42.338809967041016,-71.08809661865234,17.299999237060547,327985.5625,4689506.5,19,T
1644449889.2627692,[-----GPS DATA-----],42.338809967041016,-71.08809661865234,17.299999237060547,327985.5625,4689506.5,19,T
1644449890.3191183,[-----GPS DATA-----],42.338809967041016,-71.08809661865234,17.299999237060547,327985.5625,4689506.5,19,T
1644449891.2631137,[-----GPS DATA-----],42.338809967041016,-71.08809661865234,17.299999237060547,327985.5625,4689506.5,19,T
1644449892.261881,[-----GPS DATA-----],42.338809967041016,-71.08809661865234,17.299999237060547,327985.5625,4689506.5,19,T
1644449893.2627835,[-----GPS DATA-----],42.338809967041016,-71.08809661865234,17.299999237060547,327985.5625,4689506.5,19,T
1644449894.2645779,[-----GPS DATA-----],42.338809967041016,-71.08809661865234,17.299999237060547,327985.5625,4689506.5,19,T
1644449895.3212852,[-----GPS DATA-----],42.338809967041016,-71.08809661865234,17.299999237060547,327985.5625,4689506.5,19,T
1644449896.2642324,[-----GPS DATA-----],42.338809967041016,-71.08809661865234,17.399999618530273,327985.5625,4689506.5,19,T
1644449897.2644117,[-----GPS DATA-----],42.338809967041016,-71.08809661865234,17.399999618530273,327985.5625,4689506.5,19,T
1644449898.264803,[-----GPS DATA-----],42.338809967041016,-71.08809661865234,17.399999618530273,327985.5625,4689506.5,19,T
1644449899.264684,[-----GPS DATA-----],42.338809967041016,-71.08809661865234,17.399999618530273,327985.5625,4689506.5,19,T
1644449900.321247,[-----GPS DATA-----],42.338809967041016,-71.08809661865234,17.399999618530273,327985.5625,4689506.5,19,T
1644449901.2649348,[-----GPS DATA-----],42.338809967041016,-71.08809661865234,17.399999618530273,327985.5625,4689506.5,19,T
1644449902.3006473,[-----GPS DATA-----],42.338809967041016,-71.08809661865234,17.399999618530273,327985.5625,4689506.5,19,T
1644449903.2648616,[-----GPS DATA-----],42.338809967041016,-71.08809661865234,17.399999618530273,327985.5625,4689506.5,19,T
1644449904.2653296,[-----GPS DATA-----],42.338809967041016,-71.08809661865234,17.399999618530273,327985.5625,4689506.5,19,T
1644449905.3223543,[-----GPS DATA-----],42.338809967041016,-71.08809661865234,17.399999618530273,327985.5625,4689506.5,19,T
1644449906.2630904,[-----GPS DATA-----],42.338809967041016,-71.08809661865234,17.399999618530273,327985.5625,4689506.5,19,T
1644449907.2651956,[-----GPS DATA-----],42.338809967041016,-71.08809661865234,17.399999618530273,327985.5625,4689506.5,19,T
1644449908.264614,[-----GPS DATA-----],42.338809967041016,-71.08809661865234,17.399999618530273,327985.5625,4689506.5,19,T
1644449909.2656648,[-----GPS DATA-----],42.338809967041016,-71.08809661865234,17.399999618530273,327985.5625,4689506.5,19,T
1644449910.3219578,[-----GPS DATA-----],42.338809967041016,-71.08809661865234,17.399999618530273,327985.5625,4689506.5,19,T
1644449911.2627447,[-----GPS DATA-----],42.338809967041016,-71.08809661865234,17.399999618530273,327985.5625,4689506.5,19,T
1644449912.2620614,[-----GPS DATA-----],42.338809967041016,-71.08809661865234,17.399999618530273,327985.5625,4689506.5,19,T
1644449913.2617373,[-----GPS DATA-----],42.338809967041016,-71.08809661865234,17.5,327985.5625,4689506.5,19,T
1644449914.2623744,[-----GPS DATA-----],42.338809967041016,-71.08809661865234,17.5,327985.5625,4689506.5,19,T
1644449915.3187652,[-----GPS DATA-----],42.338809967041016,-71.08809661865234,17.5,327985.5625,4689506.5,19,T
1644449916.2633266,[-----GPS DATA-----],42.338809967041016,-71.08809661865234,17.5,327985.5625,4689506.5,19,T
1644449917.2619915,[-----GPS DATA-----],42.338809967041016,-71.08809661865234,17.5,327985.5625,4689506.5,19,T
1644449918.2622573,[-----GPS DATA-----],42.338809967041016,-71.08809661865234,17.5,327985.5625,4689506.5,19,T
1644449919.261892,[-----GPS DATA-----],42.338809967041016,-71.08809661865234,17.5,327985.5625,4689506.5,19,T
1644449920.3184419,[-----GPS DATA-----],42.338809967041016,-71.08809661865234,17.5,327985.5625,4689506.5,19,T
1644449921.2627435,[-----GPS DATA-----],42.338809967041016,-71.08809661865234,17.5,327985.5625,4689506.5,19,T
1644449922.262749,[-----GPS DATA-----],42.338809967041016,-71.08809661865234,17.5,327985.5625,4689506.5,19,T
1644449923.2633367,[-----GPS DATA-----],42.338809967041016,-71.08809661865234,17.5,327985.5625,4689506.5,19,T
1644449924.299892,[-----GPS DATA-----],42.338809967041016,-71.08809661865234,17.5,327985.4375,4689506.5,19,T
1644449925.3565533,[-----GPS DATA-----],42.338809967041016,-71.08809661865234,17.5,327985.4375,4689506.5,19,T
1644449926.2626555,[-----GPS DATA-----],42.338809967041016,-71.08809661865234,17.5,327985.4375,4689506.5,19,T
1644449927.2627165,[-----GPS DATA-----],42.338809967041016,-71.08809661865234,17.5,327985.4375,4689506.5,19,T
1644449928.2996845,[-----GPS DATA-----],42.338809967041016,-71.08809661865234,17.5,327985.4375,4689506.5,19,T
1644449929.300241,[-----GPS DATA-----],42.338809967041016,-71.08809661865234,17.5,327985.4375,4689506.5,19,T
1644449930.3570461,[-----GPS DATA-----],42.338809967041016,-71.08809661865234,17.600000381469727,327985.4375,4689506.5,19,T
1644449931.263075,[-----GPS DATA-----],42.338809967041016,-71.08809661865234,17.600000381469727,327985.4375,4689506.5,19,T
1644449932.2616186,[-----GPS DATA-----],42.338809967041016,-71.08809661865234,17.600000381469727,327985.4375,4689506.5,19,T
1644449933.2629957,[-----GPS DATA-----],42.338809967041016,-71.08809661865234,17.600000381469727,327985.4375,4689506.5,19,T
1644449934.262551,[-----GPS DATA-----],42.338809967041016,-71.08809661865234,17.600000381469727,327985.4375,4689506.5,19,T
1644449935.3184962,[-----GPS DATA-----],42.338809967041016,-71.08809661865234,17.600000381469727,327985.4375,4689506.5,19,T
1644449936.262511,[-----GPS DATA-----],42.338809967041016,-71.08809661865234,17.600000381469727,327985.5625,4689506.5,19,T
1644449937.2622721,[-----GPS DATA-----],42.338809967041016,-71.08809661865234,17.600000381469727,327985.4375,4689506.5,19,T
1644449938.262545,[-----GPS DATA-----],42.338809967041016,-71.08809661865234,17.700000762939453,327985.4375,4689506.5,19,T
1644449939.2614784,[-----GPS DATA-----],42.338809967041016,-71.08809661865234,17.700000762939453,327985.4375,4689506.5,19,T
1644449940.3176577,[-----GPS DATA-----],42.338809967041016,-71.08809661865234,17.700000762939453,327985.5625,4689506.5,19,T
1644449941.2612467,[-----GPS DATA-----],42.338809967041016,-71.08809661865234,17.700000762939453,327985.4375,4689506.5,19,T
1644449942.2613375,[-----GPS DATA-----],42.338809967041016,-71.08809661865234,17.700000762939453,327985.5625,4689506.5,19,T
1644449943.260878,[-----GPS DATA-----],42.33879852294922,-71.08809661865234,18.899999618530273,327985.40625,4689505.5,19,T
1644449944.2618067,[-----GPS DATA-----],42.33879852294922,-71.08809661865234,18.899999618530273,327985.40625,4689505.5,19,T
1644449945.318124,[-----GPS DATA-----],42.33879852294922,-71.08809661865234,18.899999618530273,327985.40625,4689505.5,19,T
1644449946.2610328,[-----GPS DATA-----],42.33879852294922,-71.08809661865234,18.899999618530273,327985.40625,4689505.5,19,T
1644449947.2630239,[-----GPS DATA-----],42.33879852294922,-71.08809661865234,18.899999618530273,327985.40625,4689505.5,19,T
1644449948.2613516,[-----GPS DATA-----],42.33879852294922,-71.08809661865234,18.899999618530273,327985.40625,4689505.5,19,T
1644449949.2612846,[-----GPS DATA-----],42.33879852294922,-71.08809661865234,18.899999618530273,327985.40625,4689505.5,19,T
1644449950.3176446,[-----GPS DATA-----],42.33879852294922,-71.08809661865234,18.899999618530273,327985.40625,4689505.5,19,T
1644449951.2620308,[-----GPS DATA-----],42.33879852294922,-71.08809661865234,18.899999618530273,327985.40625,4689505.5,19,T
1644449952.299628,[-----GPS DATA-----],42.33879852294922,-71.08809661865234,19.0,327985.40625,4689505.5,19,T
1644449953.2627487,[-----GPS DATA-----],42.33879852294922,-71.08809661865234,19.0,327985.40625,4689505.5,19,T
1644449954.2683234,[-----GPS DATA-----],42.33879852294922,-71.08809661865234,19.0,327985.40625,4689505.5,19,T
1644449955.3246014,[-----GPS DATA-----],42.33879852294922,-71.08809661865234,19.0,327985.40625,4689505.5,19,T
1644449956.2622943,[-----GPS DATA-----],42.33879852294922,-71.08809661865234,19.0,327985.40625,4689505.5,19,T
1644449957.2620003,[-----GPS DATA-----],42.33879852294922,-71.08809661865234,19.0,327985.40625,4689505.5,19,T
1644449958.2621562,[-----GPS DATA-----],42.33879852294922,-71.08809661865234,19.0,327985.40625,4689505.5,19,T
1644449959.262352,[-----GPS DATA-----],42.33879852294922,-71.08809661865234,19.0,327985.40625,4689505.5,19,T
1644449960.3187542,[-----GPS DATA-----],42.33879852294922,-71.08809661865234,19.0,327985.40625,4689505.5,19,T
1644449961.2618313,[-----GPS DATA-----],42.33879852294922,-71.08809661865234,19.0,327985.40625,4689505.5,19,T
1644449962.26176,[-----GPS DATA-----],42.33879852294922,-71.08809661865234,19.100000381469727,327985.40625,4689505.5,19,T
1644449963.262184,[-----GPS DATA-----],42.33879852294922,-71.08809661865234,19.100000381469727,327985.40625,4689505.5,19,T
1644449964.2617102,[-----GPS DATA-----],42.33879852294922,-71.08809661865234,19.100000381469727,327985.40625,4689505.5,19,T
1644449965.3178236,[-----GPS DATA-----],42.33879852294922,-71.08809661865234,19.100000381469727,327985.40625,4689505.5,19,T
1644449966.2618792,[-----GPS DATA-----],42.33879852294922,-71.08809661865234,19.100000381469727,327985.40625,4689505.5,19,T
1644449967.2612593,[-----GPS DATA-----],42.33879852294922,-71.08809661865234,19.100000381469727,327985.40625,4689505.5,19,T
1644449968.2600017,[-----GPS DATA-----],42.33879852294922,-71.08809661865234,19.100000381469727,327985.40625,4689505.5,19,T
1644449969.261245,[-----GPS DATA-----],42.33879852294922,-71.08809661865234,19.100000381469727,327985.40625,4689505.5,19,T
1644449970.317156,[-----GPS DATA-----],42.33879852294922,-71.08809661865234,19.100000381469727,327985.40625,4689505.5,19,T
1644449971.2601888,[-----GPS DATA-----],42.33879852294922,-71.08809661865234,19.100000381469727,327985.40625,4689505.5,19,T
1644449972.2599893,[-----GPS DATA-----],42.33879852294922,-71.08809661865234,19.200000762939453,327985.40625,4689505.5,19,T
1644449973.2600644,[-----GPS DATA-----],42.33879852294922,-71.08809661865234,19.200000762939453,327985.40625,4689505.5,19,T
1644449974.2589462,[-----GPS DATA-----],42.33879852294922,-71.08809661865234,19.200000762939453,327985.40625,4689505.0,19,T
1644449975.315248,[-----GPS DATA-----],42.33879852294922,-71.08809661865234,19.200000762939453,327985.40625,4689505.0,19,T
1644449976.2598317,[-----GPS DATA-----],42.33879852294922,-71.08809661865234,19.200000762939453,327985.40625,4689505.0,19,T
1644449977.259698,[-----GPS DATA-----],42.33879852294922,-71.08809661865234,19.200000762939453,327985.40625,4689505.0,19,T
1644449978.2981887,[-----GPS DATA-----],42.33879852294922,-71.08809661865234,19.200000762939453,327985.40625,4689505.0,19,T
1644449979.2611299,[-----GPS DATA-----],42.33879852294922,-71.08809661865234,19.299999237060547,327985.40625,4689505.0,19,T
1644449980.3213427,[-----GPS DATA-----],42.33879852294922,-71.08809661865234,19.299999237060547,327985.40625,4689505.0,19,T
1644449981.262179,[-----GPS DATA-----],42.33879852294922,-71.08809661865234,19.299999237060547,327985.40625,4689505.0,19,T
1644449982.2623703,[-----GPS DATA-----],42.33879852294922,-71.08809661865234,19.299999237060547,327985.40625,4689505.0,19,T
1644449983.2611818,[-----GPS DATA-----],42.33879852294922,-71.08809661865234,19.299999237060547,327985.40625,4689505.0,19,T
1644449984.2605395,[-----GPS DATA-----],42.33879852294922,-71.08809661865234,19.299999237060547,327985.40625,4689505.0,19,T
1644449985.3171413,[-----GPS DATA-----],42.33879852294922,-71.08809661865234,19.399999618530273,327985.40625,4689505.0,19,T
1644449986.2648697,[-----GPS DATA-----],42.33879852294922,-71.08809661865234,19.399999618530273,327985.40625,4689505.0,19,T
1644449987.26445,[-----GPS DATA-----],42.33879852294922,-71.08809661865234,19.399999618530273,327985.40625,4689505.0,19,T
1644449988.2642107,[-----GPS DATA-----],42.33879852294922,-71.08809661865234,19.399999618530273,327985.40625,4689505.0,19,T
1644449989.2610013,[-----GPS DATA-----],42.33879852294922,-71.08809661865234,19.399999618530273,327985.40625,4689505.0,19,T
1644449990.3172941,[-----GPS DATA-----],42.33879852294922,-71.08809661865234,19.5,327985.40625,4689505.0,19,T
1644449991.2648237,[-----GPS DATA-----],42.33879852294922,-71.08809661865234,19.5,327985.40625,4689505.0,19,T
1644449992.2642725,[-----GPS DATA-----],42.33879852294922,-71.08809661865234,19.5,327985.40625,4689505.5,19,T
1644449993.2639184,[-----GPS DATA-----],42.33879852294922,-71.08809661865234,19.5,327985.28125,4689505.5,19,T
1644449994.2617524,[-----GPS DATA-----],42.33879852294922,-71.08809661865234,19.5,327985.28125,4689505.5,19,T
1644449995.3183622,[-----GPS DATA-----],42.33879852294922,-71.08809661865234,19.5,327985.28125,4689505.5,19,T
1644449996.2618744,[-----GPS DATA-----],42.33879852294922,-71.08809661865234,19.600000381469727,327985.28125,4689505.5,19,T
1644449997.2642078,[-----GPS DATA-----],42.33879852294922,-71.08809661865234,19.600000381469727,327985.28125,4689505.5,19,T
1644449998.2625577,[-----GPS DATA-----],42.33879852294922,-71.08809661865234,19.600000381469727,327985.28125,4689505.5,19,T
1644449999.2615666,[-----GPS DATA-----],42.33879852294922,-71.08809661865234,19.600000381469727,327985.28125,4689505.5,19,T
1644450000.3195708,[-----GPS DATA-----],42.33879852294922,-71.08809661865234,19.600000381469727,327985.28125,4689505.5,19,T
1644450001.2617943,[-----GPS DATA-----],42.33879852294922,-71.08809661865234,19.600000381469727,327985.28125,4689505.5,19,T
1644450002.2612445,[-----GPS DATA-----],42.33879852294922,-71.08809661865234,19.600000381469727,327985.28125,4689505.5,19,T
1644450003.2983398,[-----GPS DATA-----],42.33879852294922,-71.08809661865234,19.600000381469727,327985.28125,4689505.5,19,T
1644450004.2620168,[-----GPS DATA-----],42.33879852294922,-71.08809661865234,19.700000762939453,327985.28125,4689505.5,19,T
1644450005.3183398,[-----GPS DATA-----],42.33879852294922,-71.08809661865234,19.700000762939453,327985.28125,4689505.5,19,T
1644450006.2631555,[-----GPS DATA-----],42.33879852294922,-71.08809661865234,19.700000762939453,327985.28125,4689505.5,19,T
1644450007.2646835,[-----GPS DATA-----],42.33879852294922,-71.08809661865234,19.700000762939453,327985.28125,4689505.5,19,T
1644450008.261892,[-----GPS DATA-----],42.33879852294922,-71.08809661865234,19.700000762939453,327985.28125,4689505.5,19,T
1644450009.2607665,[-----GPS DATA-----],42.33879852294922,-71.08809661865234,19.700000762939453,327985.28125,4689505.5,19,T
1644450010.3206823,[-----GPS DATA-----],42.33879852294922,-71.08809661865234,19.700000762939453,327985.28125,4689505.5,19,T
1644450011.2607293,[-----GPS DATA-----],42.33879852294922,-71.08809661865234,19.700000762939453,327985.28125,4689505.5,19,T
1644450012.2619092,[-----GPS DATA-----],42.33879852294922,-71.08809661865234,19.700000762939453,327985.28125,4689505.5,19,T
1644450013.2613685,[-----GPS DATA-----],42.33879852294922,-71.08809661865234,19.799999237060547,327985.28125,4689505.5,19,T
1644450014.2650146,[-----GPS DATA-----],42.33879852294922,-71.08809661865234,19.799999237060547,327985.28125,4689505.5,19,T
1644450015.3214612,[-----GPS DATA-----],42.33879852294922,-71.08809661865234,19.799999237060547,327985.28125,4689505.5,19,T
1644450016.2616994,[-----GPS DATA-----],42.33879852294922,-71.08809661865234,19.799999237060547,327985.28125,4689505.5,19,T
1644450017.2620506,[-----GPS DATA-----],42.33879852294922,-71.08809661865234,19.799999237060547,327985.28125,4689505.5,19,T
1644450018.2619343,[-----GPS DATA-----],42.33879852294922,-71.08809661865234,19.799999237060547,327985.28125,4689505.5,19,T
1644450019.2613215,[-----GPS DATA-----],42.33879852294922,-71.08809661865234,19.799999237060547,327985.28125,4689505.5,19,T
1644450020.3176692,[-----GPS DATA-----],42.33879852294922,-71.08809661865234,19.799999237060547,327985.28125,4689505.5,19,T
1644450021.2603428,[-----GPS DATA-----],42.33879852294922,-71.08809661865234,19.799999237060547,327985.28125,4689505.5,19,T
1644450022.2607079,[-----GPS DATA-----],42.33879852294922,-71.08809661865234,19.899999618530273,327985.28125,4689505.5,19,T
1644450023.260654,[-----GPS DATA-----],42.33879852294922,-71.08809661865234,19.899999618530273,327985.28125,4689505.5,19,T
1644450024.259875,[-----GPS DATA-----],42.33879852294922,-71.08809661865234,19.899999618530273,327985.28125,4689505.5,19,T
1644450025.3177621,[-----GPS DATA-----],42.33879852294922,-71.08809661865234,19.899999618530273,327985.28125,4689505.5,19,T
1644450026.2614715,[-----GPS DATA-----],42.33879852294922,-71.08809661865234,19.899999618530273,327985.28125,4689505.5,19,T
1644450027.2608466,[-----GPS DATA-----],42.33879852294922,-71.08809661865234,19.899999618530273,327985.28125,4689505.5,19,T
1644450028.2603736,[-----GPS DATA-----],42.33879852294922,-71.08809661865234,19.899999618530273,327985.28125,4689505.5,19,T
1644450029.2968292,[-----GPS DATA-----],42.33879852294922,-71.08809661865234,19.899999618530273,327985.28125,4689505.5,19,T
1644450030.3533304,[-----GPS DATA-----],42.33879852294922,-71.08809661865234,19.899999618530273,327985.28125,4689505.5,19,T
1644450031.3018024,[-----GPS DATA-----],42.33879852294922,-71.08809661865234,20.0,327985.28125,4689505.5,19,T
1644450032.2615645,[-----GPS DATA-----],42.33879852294922,-71.08809661865234,20.0,327985.28125,4689505.5,19,T
1644450033.261391,[-----GPS DATA-----],42.33879852294922,-71.08809661865234,20.0,327985.28125,4689505.5,19,T
1644450034.2607155,[-----GPS DATA-----],42.33879852294922,-71.08809661865234,20.0,327985.28125,4689505.5,19,T
1644450035.3178208,[-----GPS DATA-----],42.33879852294922,-71.08809661865234,20.0,327985.28125,4689505.5,19,T
