Time,GPS_HEADER,GPS_LATITUDE,GPS_LONGITUDE,GPS_ALTITUDE,GPS_EASTING,GPS_NORTHING,GPS_ZONE_NUMBER,GPS_ZONE_LETTER
1644452407.2789192,[-----GPS DATA-----],42.340187072753906,-71.08438873291016,15.5,328295.09375,4689652.0,19,T
1644452408.2796552,[-----GPS DATA-----],42.340187072753906,-71.08438873291016,15.5,328295.09375,4689652.0,19,T
1644452409.2794921,[-----GPS DATA-----],42.340187072753906,-71.08438873291016,15.5,328295.09375,4689652.0,19,T
1644452410.3399084,[-----GPS DATA-----],42.340187072753906,-71.08438873291016,15.5,328295.09375,4689652.0,19,T
1644452411.2814214,[-----GPS DATA-----],42.340187072753906,-71.08438873291016,15.5,328295.09375,4689652.0,19,T
1644452412.282863,[-----GPS DATA-----],42.340187072753906,-71.08438873291016,15.5,328295.09375,4689652.0,19,T
1644452413.298188,[-----GPS DATA-----],42.340187072753906,-71.08438873291016,15.5,328295.09375,4689652.0,19,T
1644452414.2800736,[-----GPS DATA-----],42.340187072753906,-71.08438873291016,15.5,328295.09375,4689652.0,19,T
1644452415.342505,[-----GPS DATA-----],42.340187072753906,-71.08438873291016,15.5,328295.09375,4689652.0,19,T
1644452416.2799213,[-----GPS DATA-----],42.340187072753906,-71.08438873291016,15.5,328295.09375,4689652.0,19,T
1644452417.2994163,[-----GPS DATA-----],42.340187072753906,-71.08438873291016,15.5,328295.09375,4689652.0,19,T
1644452418.2975187,[-----GPS DATA-----],42.340187072753906,-71.08438873291016,15.5,328295.09375,4689652.0,19,T
1644452419.281877,[-----GPS DATA-----],42.340187072753906,-71.08438873291016,15.5,328295.09375,4689652.0,19,T
1644452420.344238,[-----GPS DATA-----],42.34018325805664,-71.08438873291016,15.5,328294.8125,4689652.0,19,T
1644452421.2806635,[-----GPS DATA-----],42.34018325805664,-71.08439636230469,15.5,328294.40625,4689651.5,19,T
1644452422.2789996,[-----GPS DATA-----],42.340179443359375,-71.08439636230469,15.5,328293.96875,4689651.5,19,T
1644452423.2832353,[-----GPS DATA-----],42.34017562866211,-71.08440399169922,15.399999618530273,328293.5625,4689651.0,19,T
1644452424.280336,[-----GPS DATA-----],42.340171813964844,-71.08441162109375,15.399999618530273,328293.125,4689650.5,19,T
1644452425.3426354,[-----GPS DATA-----],42.340171813964844,-71.08441162109375,15.399999618530273,328292.84375,4689650.0,19,T
1644452426.2794652,[-----GPS DATA-----],42.34016799926758,-71.08441925048828,15.399999618530273,328292.4375,4689650.0,19,T
1644452427.280856,[-----GPS DATA-----],42.34016418457031,-71.08441925048828,15.399999618530273,328292.15625,4689649.5,19,T
1644452428.2804995,[-----GPS DATA-----],42.34016418457031,-71.08442687988281,15.399999618530273,328291.875,4689649.5,19,T
1644452429.2800205,[-----GPS DATA-----],42.34016036987305,-71.08442687988281,15.399999618530273,328291.59375,4689649.0,19,T
1644452430.3413517,[-----GPS DATA-----],42.34015655517578,-71.08442687988281,15.399999618530273,328291.3125,4689648.5,19,T
1644452431.2807608,[-----GPS DATA-----],42.34015655517578,-71.08443450927734,15.399999618530273,328291.03125,4689648.5,19,T
1644452432.280512,[-----GPS DATA-----],42.340152740478516,-71.08444213867188,15.399999618530273,328290.59375,4689648.0,19,T
1644452433.2798676,[-----GPS DATA-----],42.34014892578125,-71.08444213867188,15.300000190734863,328290.1875,4689648.0,19,T
1644452434.2795396,[-----GPS DATA-----],42.340145111083984,-71.0844497680664,15.300000190734863,328289.75,4689647.5,19,T
1644452435.3393216,[-----GPS DATA-----],42.34014129638672,-71.08445739746094,15.300000190734863,328289.21875,4689647.0,19,T
1644452436.285903,[-----GPS DATA-----],42.34013366699219,-71.08446502685547,15.300000190734863,328288.625,4689646.5,19,T
1644452437.2789505,[-----GPS DATA-----],42.34012985229492,-71.08446502685547,15.300000190734863,328288.09375,4689646.0,19,T
1644452438.2778184,[-----GPS DATA-----],42.340126037597656,-71.08447265625,15.300000190734863,328287.53125,4689645.5,19,T
1644452439.2784276,[-----GPS DATA-----],42.34012222290039,-71.08448028564453,15.300000190734863,328286.96875,4689645.0,19,T
1644452440.3399942,[-----GPS DATA-----],42.340118408203125,-71.08448791503906,15.199999809265137,328286.40625,4689644.5,19,T
1644452441.278861,[-----GPS DATA-----],42.34011459350586,-71.0844955444336,15.300000190734863,328285.96875,4689644.0,19,T
1644452442.2818367,[-----GPS DATA-----],42.34010696411133,-71.08450317382812,15.300000190734863,328285.40625,4689643.5,19,T
1644452443.2802842,[-----GPS DATA-----],42.34010314941406,-71.08450317382812,15.300000190734863,328285.0,4689643.0,19,T
1644452444.279297,[-----GPS DATA-----],42.34010314941406,-71.08451080322266,15.399999618530273,328284.4375,4689643.0,19,T
1644452445.3408608,[-----GPS DATA-----],42.3400993347168,-71.08451843261719,15.399999618530273,328283.875,4689642.5,19,T
1644452446.278678,[-----GPS DATA-----],42.34009552001953,-71.08452606201172,15.5,328283.3125,4689642.0,19,T
1644452447.2798772,[-----GPS DATA-----],42.340091705322266,-71.08453369140625,16.0,328282.90625,4689641.5,19,T
1644452448.280899,[-----GPS DATA-----],42.340087890625,-71.08453369140625,16.200000762939453,328282.34375,4689641.5,19,T
1644452449.2802894,[-----GPS DATA-----],42.340087890625,-71.08454132080078,16.399999618530273,328281.90625,4689641.0,19,T
1644452450.3421307,[-----GPS DATA-----],42.340084075927734,-71.08454895019531,16.5,328281.5,4689641.0,19,T
1644452451.2809746,[-----GPS DATA-----],42.34008026123047,-71.08454895019531,16.600000381469727,328281.21875,4689640.5,19,T
1644452452.281221,[-----GPS DATA-----],42.3400764465332,-71.08455657958984,16.700000762939453,328280.8125,4689640.5,19,T
1644452453.2808332,[-----GPS DATA-----],42.3400764465332,-71.08455657958984,16.799999237060547,328280.5,4689640.0,19,T
1644452454.283655,[-----GPS DATA-----],42.34007263183594,-71.08456420898438,16.799999237060547,328280.09375,4689640.0,19,T
1644452455.3461423,[-----GPS DATA-----],42.34006881713867,-71.0845718383789,16.899999618530273,328279.6875,4689639.5,19,T
1644452456.282048,[-----GPS DATA-----],42.340065002441406,-71.0845718383789,17.0,328279.53125,4689639.0,19,T
1644452457.279298,[-----GPS DATA-----],42.340065002441406,-71.0845718383789,17.0,328279.25,4689639.0,19,T
1644452458.2815135,[-----GPS DATA-----],42.340065002441406,-71.08457946777344,17.100000381469727,328278.96875,4689638.5,19,T
1644452459.2817388,[-----GPS DATA-----],42.34006118774414,-71.08457946777344,17.200000762939453,328278.6875,4689638.5,19,T
1644452460.3441215,[-----GPS DATA-----],42.340057373046875,-71.08458709716797,17.200000762939453,328278.40625,4689638.0,19,T
1644452461.2951164,[-----GPS DATA-----],42.34005355834961,-71.08458709716797,17.200000762939453,328278.125,4689638.0,19,T
1644452462.279035,[-----GPS DATA-----],42.34005355834961,-71.0845947265625,17.299999237060547,328277.71875,4689637.5,19,T
1644452463.2811542,[-----GPS DATA-----],42.340049743652344,-71.0845947265625,17.299999237060547,328277.4375,4689637.0,19,T
1644452464.297968,[-----GPS DATA-----],42.34004592895508,-71.0845947265625,17.299999237060547,328277.15625,4689637.0,19,T
1644452465.3598263,[-----GPS DATA-----],42.34004211425781,-71.08460235595703,17.299999237060547,328276.71875,4689636.5,19,T
1644452466.280745,[-----GPS DATA-----],42.34003829956055,-71.08460998535156,17.399999618530273,328276.3125,4689636.0,19,T
1644452467.2807243,[-----GPS DATA-----],42.34003829956055,-71.08460998535156,17.399999618530273,328276.03125,4689636.0,19,T
1644452468.2985282,[-----GPS DATA-----],42.34003448486328,-71.0846176147461,17.399999618530273,328275.59375,4689635.5,19,T
1644452469.2968917,[-----GPS DATA-----],42.340030670166016,-71.08462524414062,17.399999618530273,328275.1875,4689635.0,19,T
1644452470.3595414,[-----GPS DATA-----],42.34002685546875,-71.08462524414062,17.399999618530273,328274.875,4689634.5,19,T
1644452471.2819586,[-----GPS DATA-----],42.34002685546875,-71.08463287353516,17.399999618530273,328274.34375,4689634.5,19,T
1644452472.2819188,[-----GPS DATA-----],42.340023040771484,-71.08463287353516,17.399999618530273,328273.90625,4689634.0,19,T
1644452473.280506,[-----GPS DATA-----],42.34001922607422,-71.08464050292969,17.5,328273.5,4689634.0,19,T
1644452474.2802193,[-----GPS DATA-----],42.34001541137695,-71.08464813232422,17.5,328273.0625,4689633.5,19,T
1644452475.3429527,[-----GPS DATA-----],42.34001159667969,-71.08464813232422,17.700000762939453,328272.65625,4689633.0,19,T
1644452476.2812335,[-----GPS DATA-----],42.34000778198242,-71.08465576171875,17.799999237060547,328272.375,4689632.5,19,T
1644452477.284593,[-----GPS DATA-----],42.34000778198242,-71.08466339111328,17.799999237060547,328271.9375,4689632.5,19,T
1644452478.277419,[-----GPS DATA-----],42.340003967285156,-71.08466339111328,17.799999237060547,328271.65625,4689632.0,19,T
1644452479.2827878,[-----GPS DATA-----],42.34000015258789,-71.08467102050781,17.799999237060547,328271.25,4689632.0,19,T
1644452480.3446686,[-----GPS DATA-----],42.339996337890625,-71.08467102050781,17.799999237060547,328270.96875,4689631.5,19,T
1644452481.2777035,[-----GPS DATA-----],42.33999252319336,-71.08467864990234,17.799999237060547,328270.53125,4689631.0,19,T
1644452482.2794766,[-----GPS DATA-----],42.339988708496094,-71.08467864990234,17.799999237060547,328270.125,4689630.5,19,T
1644452483.2800114,[-----GPS DATA-----],42.33998489379883,-71.08468627929688,17.799999237060547,328269.6875,4689630.5,19,T
1644452484.283064,[-----GPS DATA-----],42.33998489379883,-71.0846939086914,17.799999237060547,328269.28125,4689630.0,19,T
1644452485.345563,[-----GPS DATA-----],42.33998107910156,-71.0846939086914,17.799999237060547,328268.84375,4689629.5,19,T
1644452486.2790577,[-----GPS DATA-----],42.3399772644043,-71.08470153808594,17.799999237060547,328268.4375,4689629.5,19,T
1644452487.2801414,[-----GPS DATA-----],42.33997344970703,-71.08470916748047,17.799999237060547,328268.03125,4689629.0,19,T
1644452488.280058,[-----GPS DATA-----],42.33997344970703,-71.08470916748047,17.799999237060547,328267.75,4689629.0,19,T
1644452489.2792873,[-----GPS DATA-----],42.339969635009766,-71.084716796875,17.799999237060547,328267.1875,4689628.5,19,T
1644452490.341645,[-----GPS DATA-----],42.3399658203125,-71.08472442626953,17.799999237060547,328266.75,4689628.0,19,T
1644452491.2798345,[-----GPS DATA-----],42.339962005615234,-71.08472442626953,17.799999237060547,328266.34375,4689627.5,19,T
1644452492.2805438,[-----GPS DATA-----],42.33995819091797,-71.08473205566406,17.700000762939453,328265.90625,4689627.5,19,T
1644452493.279935,[-----GPS DATA-----],42.33995819091797,-71.0847396850586,17.700000762939453,328265.5,4689627.0,19,T
1644452494.2776823,[-----GPS DATA-----],42.33995056152344,-71.0847396850586,17.700000762939453,328265.0625,4689626.5,19,T
1644452495.339962,[-----GPS DATA-----],42.33994674682617,-71.08474731445312,17.700000762939453,328264.53125,4689626.5,19,T
1644452496.2803214,[-----GPS DATA-----],42.33994674682617,-71.08475494384766,17.700000762939453,328264.09375,4689626.0,19,T
1644452497.2795568,[-----GPS DATA-----],42.339942932128906,-71.08476257324219,17.700000762939453,328263.53125,4689625.5,19,T
1644452498.2774231,[-----GPS DATA-----],42.33993911743164,-71.08477020263672,17.700000762939453,328262.96875,4689625.5,19,T
1644452499.279715,[-----GPS DATA-----],42.339935302734375,-71.08477020263672,17.700000762939453,328262.5625,4689625.0,19,T
1644452500.341944,[-----GPS DATA-----],42.33993148803711,-71.08477783203125,17.700000762939453,328262.0,4689624.5,19,T
1644452501.2799642,[-----GPS DATA-----],42.339927673339844,-71.08478546142578,17.600000381469727,328261.4375,4689624.0,19,T
1644452502.279184,[-----GPS DATA-----],42.33992385864258,-71.08479309082031,17.600000381469727,328261.03125,4689623.5,19,T
1644452503.2797043,[-----GPS DATA-----],42.33992004394531,-71.08479309082031,17.600000381469727,328260.46875,4689623.5,19,T
1644452504.2808614,[-----GPS DATA-----],42.33992004394531,-71.08480072021484,17.5,328260.03125,4689623.0,19,T
1644452505.3438241,[-----GPS DATA-----],42.33991622924805,-71.08480834960938,17.5,328259.46875,4689622.5,19,T
1644452506.2777753,[-----GPS DATA-----],42.33991241455078,-71.0848159790039,17.5,328259.0625,4689622.5,19,T
1644452507.2794626,[-----GPS DATA-----],42.339908599853516,-71.0848159790039,17.399999618530273,328258.65625,4689622.0,19,T
1644452508.280481,[-----GPS DATA-----],42.33990478515625,-71.08482360839844,17.399999618530273,328258.21875,4689621.5,19,T
1644452509.2788448,[-----GPS DATA-----],42.339900970458984,-71.08483123779297,17.299999237060547,328257.8125,4689621.0,19,T
1644452510.340976,[-----GPS DATA-----],42.339900970458984,-71.08483123779297,17.299999237060547,328257.375,4689621.0,19,T
1644452511.2848911,[-----GPS DATA-----],42.33989715576172,-71.0848388671875,17.200000762939453,328256.96875,4689620.5,19,T
1644452512.297522,[-----GPS DATA-----],42.33989334106445,-71.08484649658203,17.200000762939453,328256.53125,4689620.5,19,T
1644452513.280912,[-----GPS DATA-----],42.33988952636719,-71.08484649658203,17.100000381469727,328256.125,4689620.0,19,T
1644452514.2797832,[-----GPS DATA-----],42.33988571166992,-71.08485412597656,17.100000381469727,328255.6875,4689619.5,19,T
1644452515.3423498,[-----GPS DATA-----],42.339881896972656,-71.0848617553711,17.100000381469727,328255.28125,4689619.5,19,T
1644452516.281807,[-----GPS DATA-----],42.339881896972656,-71.0848617553711,17.100000381469727,328254.875,4689619.0,19,T
1644452517.2795413,[-----GPS DATA-----],42.33987808227539,-71.08486938476562,17.100000381469727,328254.3125,4689618.5,19,T
1644452518.280774,[-----GPS DATA-----],42.339874267578125,-71.08487701416016,17.100000381469727,328253.875,4689618.5,19,T
1644452519.286244,[-----GPS DATA-----],42.33987045288086,-71.08487701416016,17.100000381469727,328253.46875,4689618.0,19,T
1644452520.3490264,[-----GPS DATA-----],42.339866638183594,-71.08488464355469,17.100000381469727,328253.03125,4689617.5,19,T
1644452521.2794702,[-----GPS DATA-----],42.339866638183594,-71.08489227294922,17.200000762939453,328252.625,4689617.5,19,T
1644452522.2969608,[-----GPS DATA-----],42.33986282348633,-71.08489227294922,17.100000381469727,328252.1875,4689617.0,19,T
1644452523.2982037,[-----GPS DATA-----],42.33985900878906,-71.08489990234375,17.100000381469727,328251.78125,4689616.5,19,T
1644452524.282301,[-----GPS DATA-----],42.3398551940918,-71.08490753173828,17.100000381469727,328251.375,4689616.5,19,T
1644452525.3444245,[-----GPS DATA-----],42.3398551940918,-71.08490753173828,17.100000381469727,328250.9375,4689616.0,19,T
1644452526.281809,[-----GPS DATA-----],42.339847564697266,-71.08491516113281,17.100000381469727,328250.5,4689615.5,19,T
1644452527.2820876,[-----GPS DATA-----],42.33984375,-71.08492279052734,17.0,328250.09375,4689615.0,19,T
1644452528.2814193,[-----GPS DATA-----],42.339839935302734,-71.08492279052734,17.0,328249.6875,4689615.0,19,T
1644452529.2819161,[-----GPS DATA-----],42.339839935302734,-71.08493041992188,17.0,328249.25,4689614.5,19,T
1644452530.343725,[-----GPS DATA-----],42.33983612060547,-71.08493041992188,16.899999618530273,328248.96875,4689614.0,19,T
1644452531.2816944,[-----GPS DATA-----],42.3398323059082,-71.0849380493164,16.899999618530273,328248.53125,4689613.5,19,T
1644452532.2820592,[-----GPS DATA-----],42.33982849121094,-71.08494567871094,16.899999618530273,328248.125,4689613.5,19,T
1644452533.280692,[-----GPS DATA-----],42.33982849121094,-71.08494567871094,16.799999237060547,328247.71875,4689613.0,19,T
1644452534.282914,[-----GPS DATA-----],42.33982467651367,-71.08495330810547,16.799999237060547,328247.4375,4689613.0,19,T
1644452535.3446617,[-----GPS DATA-----],42.339820861816406,-71.08495330810547,16.799999237060547,328247.15625,4689612.5,19,T
1644452536.2816896,[-----GPS DATA-----],42.33981704711914,-71.0849609375,16.799999237060547,328246.71875,4689612.0,19,T
1644452537.2818294,[-----GPS DATA-----],42.339813232421875,-71.0849609375,16.799999237060547,328246.4375,4689612.0,19,T
1644452538.2798536,[-----GPS DATA-----],42.339813232421875,-71.08496856689453,16.700000762939453,328246.03125,4689611.5,19,T
1644452539.2855268,[-----GPS DATA-----],42.33980941772461,-71.08497619628906,16.700000762939453,328245.59375,4689611.0,19,T
1644452540.347829,[-----GPS DATA-----],42.339805603027344,-71.08497619628906,16.700000762939453,328245.3125,4689611.0,19,T
1644452541.2808464,[-----GPS DATA-----],42.33980178833008,-71.0849838256836,16.700000762939453,328244.90625,4689610.5,19,T
1644452542.2794309,[-----GPS DATA-----],42.33980178833008,-71.0849838256836,16.700000762939453,328244.46875,4689610.5,19,T
1644452543.2806163,[-----GPS DATA-----],42.33979797363281,-71.08499145507812,16.700000762939453,328244.1875,4689610.0,19,T
1644452544.2829292,[-----GPS DATA-----],42.33979415893555,-71.08499145507812,16.700000762939453,328243.78125,4689609.5,19,T
1644452545.3452466,[-----GPS DATA-----],42.33979034423828,-71.08499908447266,16.700000762939453,328243.34375,4689609.0,19,T
1644452546.2792766,[-----GPS DATA-----],42.339786529541016,-71.08500671386719,16.700000762939453,328242.9375,4689609.0,19,T
1644452547.2859225,[-----GPS DATA-----],42.339786529541016,-71.08500671386719,16.700000762939453,328242.65625,4689608.5,19,T
1644452548.2795143,[-----GPS DATA-----],42.33978271484375,-71.08501434326172,16.700000762939453,328242.21875,4689608.5,19,T
1644452549.2792785,[-----GPS DATA-----],42.339778900146484,-71.08501434326172,16.700000762939453,328241.9375,4689608.0,19,T
1644452550.3412886,[-----GPS DATA-----],42.33977508544922,-71.08502197265625,16.700000762939453,328241.53125,4689607.5,19,T
1644452551.2818909,[-----GPS DATA-----],42.33977508544922,-71.08502197265625,16.700000762939453,328241.25,4689607.5,19,T
1644452552.281878,[-----GPS DATA-----],42.33977127075195,-71.08502960205078,16.700000762939453,328240.8125,4689607.0,19,T
1644452553.2806826,[-----GPS DATA-----],42.33976745605469,-71.08502960205078,16.700000762939453,328240.53125,4689606.5,19,T
1644452554.279456,[-----GPS DATA-----],42.33976364135742,-71.08503723144531,16.600000381469727,328240.25,4689606.5,19,T
1644452555.3419847,[-----GPS DATA-----],42.339759826660156,-71.08504486083984,16.600000381469727,328239.84375,4689606.0,19,T
1644452556.28154,[-----GPS DATA-----],42.339759826660156,-71.08504486083984,16.600000381469727,328239.5625,4689606.0,19,T
1644452557.2806857,[-----GPS DATA-----],42.33975601196289,-71.08505249023438,16.600000381469727,328239.15625,4689605.5,19,T
1644452558.2792387,[-----GPS DATA-----],42.339752197265625,-71.08505249023438,16.600000381469727,328238.875,4689605.0,19,T
1644452559.281206,[-----GPS DATA-----],42.33974838256836,-71.0850601196289,16.700000762939453,328238.4375,4689605.0,19,T
1644452560.344095,[-----GPS DATA-----],42.33974838256836,-71.0850601196289,16.700000762939453,328238.15625,4689604.5,19,T
1644452561.2809222,[-----GPS DATA-----],42.339744567871094,-71.08506774902344,16.700000762939453,328237.75,4689604.5,19,T
1644452562.2804148,[-----GPS DATA-----],42.33974075317383,-71.08507537841797,16.700000762939453,328237.3125,4689604.0,19,T
1644452563.300769,[-----GPS DATA-----],42.33973693847656,-71.08507537841797,16.600000381469727,328236.90625,4689603.5,19,T
1644452564.2809403,[-----GPS DATA-----],42.3397331237793,-71.0850830078125,16.5,328236.46875,4689603.0,19,T
1644452565.3433568,[-----GPS DATA-----],42.3397331237793,-71.0850830078125,16.5,328236.1875,4689603.0,19,T
1644452566.2971296,[-----GPS DATA-----],42.33972930908203,-71.08509063720703,16.399999618530273,328235.78125,4689602.5,19,T
1644452567.2829003,[-----GPS DATA-----],42.339725494384766,-71.08509826660156,16.299999237060547,328235.34375,4689602.5,19,T
1644452568.282498,[-----GPS DATA-----],42.3397216796875,-71.08509826660156,16.200000762939453,328234.9375,4689602.0,19,T
1644452569.2806318,[-----GPS DATA-----],42.339717864990234,-71.0851058959961,16.200000762939453,328234.5,4689601.5,19,T
1644452570.3426683,[-----GPS DATA-----],42.33971405029297,-71.08511352539062,16.200000762939453,328234.09375,4689601.0,19,T
1644452571.282202,[-----GPS DATA-----],42.3397102355957,-71.08511352539062,16.200000762939453,328233.53125,4689600.5,19,T
1644452572.298455,[-----GPS DATA-----],42.3397102355957,-71.08512115478516,16.200000762939453,328233.09375,4689600.5,19,T
1644452573.2983942,[-----GPS DATA-----],42.33970642089844,-71.08512878417969,16.200000762939453,328232.5625,4689600.0,19,T
1644452574.279664,[-----GPS DATA-----],42.33970260620117,-71.08513641357422,16.200000762939453,328232.125,4689599.5,19,T
1644452575.3423991,[-----GPS DATA-----],42.33969497680664,-71.08513641357422,16.200000762939453,328231.5625,4689599.0,19,T
1644452576.2819607,[-----GPS DATA-----],42.33969497680664,-71.08514404296875,16.200000762939453,328231.15625,4689598.5,19,T
1644452577.2813084,[-----GPS DATA-----],42.339691162109375,-71.08515167236328,16.200000762939453,328230.59375,4689598.5,19,T
1644452578.2793424,[-----GPS DATA-----],42.33968734741211,-71.08515930175781,16.200000762939453,328230.03125,4689598.0,19,T
1644452579.2820842,[-----GPS DATA-----],42.339683532714844,-71.08516693115234,16.100000381469727,328229.59375,4689597.5,19,T
1644452580.3471286,[-----GPS DATA-----],42.33967971801758,-71.08516693115234,16.100000381469727,328229.0625,4689597.5,19,T
1644452581.2808034,[-----GPS DATA-----],42.33967590332031,-71.08517456054688,16.100000381469727,328228.5,4689597.0,19,T
1644452582.280019,[-----GPS DATA-----],42.33967208862305,-71.0851821899414,16.200000762939453,328228.0625,4689596.5,19,T
1644452583.2814758,[-----GPS DATA-----],42.33966827392578,-71.08518981933594,16.200000762939453,328227.65625,4689596.0,19,T
1644452584.2812624,[-----GPS DATA-----],42.339664459228516,-71.08518981933594,16.200000762939453,328227.21875,4689595.5,19,T
1644452585.3468535,[-----GPS DATA-----],42.33966064453125,-71.08519744873047,16.200000762939453,328226.65625,4689595.0,19,T
1644452586.2794292,[-----GPS DATA-----],42.339656829833984,-71.085205078125,16.299999237060547,328226.25,4689595.0,19,T
1644452587.2818472,[-----GPS DATA-----],42.33965301513672,-71.08521270751953,16.299999237060547,328225.6875,4689594.5,19,T
1644452588.2818718,[-----GPS DATA-----],42.33964920043945,-71.08521270751953,16.299999237060547,328225.25,4689594.0,19,T
1644452589.2811186,[-----GPS DATA-----],42.33964538574219,-71.08522033691406,16.399999618530273,328224.6875,4689593.5,19,T
1644452590.343329,[-----GPS DATA-----],42.33964157104492,-71.0852279663086,16.399999618530273,328224.125,4689593.0,19,T
1644452591.2816901,[-----GPS DATA-----],42.339637756347656,-71.08523559570312,16.399999618530273,328223.5625,4689592.5,19,T
1644452592.2850094,[-----GPS DATA-----],42.33963394165039,-71.08524322509766,16.5,328223.15625,4689592.5,19,T
1644452593.2813528,[-----GPS DATA-----],42.339630126953125,-71.08524322509766,16.5,328222.71875,4689591.5,19,T
1644452594.279181,[-----GPS DATA-----],42.33962631225586,-71.08525085449219,16.5,328222.15625,4689591.5,19,T
1644452595.3414369,[-----GPS DATA-----],42.339622497558594,-71.08525848388672,16.600000381469727,328221.75,4689591.0,19,T
1644452596.2814202,[-----GPS DATA-----],42.33961486816406,-71.08525848388672,16.600000381469727,328221.3125,4689590.5,19,T
1644452597.2813857,[-----GPS DATA-----],42.33961486816406,-71.08526611328125,16.600000381469727,328220.78125,4689590.0,19,T
1644452598.2794545,[-----GPS DATA-----],42.33960723876953,-71.08527374267578,16.600000381469727,328220.21875,4689589.5,19,T
1644452599.2819147,[-----GPS DATA-----],42.339603424072266,-71.08528137207031,16.600000381469727,328219.78125,4689589.0,19,T
1644452600.3469424,[-----GPS DATA-----],42.339599609375,-71.08528137207031,16.600000381469727,328219.34375,4689588.5,19,T
1644452601.2826097,[-----GPS DATA-----],42.339595794677734,-71.08528900146484,16.5,328218.8125,4689588.5,19,T
1644452602.2796528,[-----GPS DATA-----],42.33959197998047,-71.08529663085938,16.399999618530273,328218.25,4689588.0,19,T
1644452603.2814338,[-----GPS DATA-----],42.3395881652832,-71.0853042602539,16.299999237060547,328217.8125,4689587.5,19,T
1644452604.2826538,[-----GPS DATA-----],42.33958435058594,-71.08531188964844,16.299999237060547,328217.40625,4689587.0,19,T
1644452605.34783,[-----GPS DATA-----],42.33958053588867,-71.08531188964844,16.299999237060547,328216.96875,4689586.5,19,T
1644452606.280633,[-----GPS DATA-----],42.339576721191406,-71.08531951904297,16.299999237060547,328216.6875,4689586.0,19,T
1644452607.2816668,[-----GPS DATA-----],42.33957290649414,-71.08531951904297,16.399999618530273,328216.25,4689586.0,19,T
1644452608.282449,[-----GPS DATA-----],42.339569091796875,-71.0853271484375,16.5,328215.84375,4689585.5,19,T
1644452609.2805703,[-----GPS DATA-----],42.33956527709961,-71.08533477783203,16.5,328215.4375,4689585.0,19,T
1644452610.3418803,[-----GPS DATA-----],42.339561462402344,-71.08533477783203,16.5,328215.0,4689584.5,19,T
1644452611.281602,[-----GPS DATA-----],42.339561462402344,-71.08534240722656,16.600000381469727,328214.59375,4689584.5,19,T
1644452612.281465,[-----GPS DATA-----],42.33955383300781,-71.0853500366211,16.600000381469727,328214.15625,4689584.0,19,T
1644452613.2805152,[-----GPS DATA-----],42.33955001831055,-71.0853500366211,16.600000381469727,328213.875,4689583.5,19,T
1644452614.2994046,[-----GPS DATA-----],42.33955001831055,-71.0853500366211,16.700000762939453,328213.59375,4689583.0,19,T
1644452615.3615756,[-----GPS DATA-----],42.33954620361328,-71.08535766601562,16.700000762939453,328213.15625,4689583.0,19,T
1644452616.283215,[-----GPS DATA-----],42.339542388916016,-71.08536529541016,16.700000762939453,328212.875,4689582.5,19,T
1644452617.2979832,[-----GPS DATA-----],42.33953857421875,-71.08536529541016,16.799999237060547,328212.59375,4689582.0,19,T
1644452618.2796726,[-----GPS DATA-----],42.339534759521484,-71.08536529541016,16.799999237060547,328212.3125,4689582.0,19,T
1644452619.282001,[-----GPS DATA-----],42.339534759521484,-71.08537292480469,16.799999237060547,328212.03125,4689581.5,19,T
1644452620.34378,[-----GPS DATA-----],42.33953094482422,-71.08537292480469,16.899999618530273,328211.75,4689581.0,19,T
1644452621.2817974,[-----GPS DATA-----],42.33952713012695,-71.08538055419922,16.899999618530273,328211.46875,4689580.5,19,T
1644452622.2798543,[-----GPS DATA-----],42.33952331542969,-71.08538055419922,16.899999618530273,328211.0625,4689580.5,19,T
1644452623.2987528,[-----GPS DATA-----],42.33951950073242,-71.08538818359375,17.0,328210.75,4689580.0,19,T
1644452624.298946,[-----GPS DATA-----],42.33951950073242,-71.08538818359375,17.0,328210.5,4689580.0,19,T
1644452625.3608825,[-----GPS DATA-----],42.339515686035156,-71.08539581298828,16.899999618530273,328210.1875,4689579.5,19,T
1644452626.2789078,[-----GPS DATA-----],42.33951187133789,-71.08539581298828,17.0,328209.90625,4689579.0,19,T
1644452627.2812839,[-----GPS DATA-----],42.339508056640625,-71.08540344238281,17.0,328209.5,4689578.5,19,T
1644452628.2818165,[-----GPS DATA-----],42.339508056640625,-71.08540344238281,17.0,328209.21875,4689578.5,19,T
1644452629.2813146,[-----GPS DATA-----],42.33950424194336,-71.08541107177734,17.0,328208.9375,4689578.0,19,T
1644452630.3437524,[-----GPS DATA-----],42.339500427246094,-71.08541107177734,17.0,328208.65625,4689578.0,19,T
1644452631.2847219,[-----GPS DATA-----],42.33949661254883,-71.08541870117188,17.100000381469727,328208.375,4689577.5,19,T
1644452632.2815456,[-----GPS DATA-----],42.33949661254883,-71.08541870117188,17.100000381469727,328207.96875,4689577.5,19,T
1644452633.2807875,[-----GPS DATA-----],42.33949661254883,-71.0854263305664,17.100000381469727,328207.6875,4689577.5,19,T
1644452634.2803006,[-----GPS DATA-----],42.33949279785156,-71.0854263305664,17.200000762939453,328207.53125,4689577.0,19,T
1644452635.3421571,[-----GPS DATA-----],42.3394889831543,-71.0854263305664,17.100000381469727,328207.25,4689576.5,19,T
1644452636.284621,[-----GPS DATA-----],42.3394889831543,-71.0854263305664,17.100000381469727,328207.09375,4689576.5,19,T
1644452637.2805893,[-----GPS DATA-----],42.33948516845703,-71.08543395996094,17.100000381469727,328206.84375,4689576.5,19,T
1644452638.2795048,[-----GPS DATA-----],42.33948516845703,-71.08543395996094,17.100000381469727,328206.6875,4689576.0,19,T
1644452639.2817678,[-----GPS DATA-----],42.339481353759766,-71.08544158935547,17.100000381469727,328206.40625,4689576.0,19,T
1644452640.3438659,[-----GPS DATA-----],42.339481353759766,-71.08544158935547,17.200000762939453,328206.125,4689575.5,19,T
1644452641.2805936,[-----GPS DATA-----],42.3394775390625,-71.08544158935547,17.200000762939453,328205.96875,4689575.5,19,T
1644452642.2789989,[-----GPS DATA-----],42.339473724365234,-71.08544921875,17.299999237060547,328205.6875,4689575.0,19,T
1644452643.2811775,[-----GPS DATA-----],42.33946990966797,-71.08544921875,17.399999618530273,328205.40625,4689574.5,19,T
1644452644.2842855,[-----GPS DATA-----],42.33946990966797,-71.08545684814453,17.5,328205.125,4689574.5,19,T
1644452645.34718,[-----GPS DATA-----],42.3394660949707,-71.08545684814453,17.5,328205.0,4689574.0,19,T
1644452646.2795324,[-----GPS DATA-----],42.33946228027344,-71.08545684814453,17.600000381469727,328204.71875,4689574.0,19,T
1644452647.281714,[-----GPS DATA-----],42.33946228027344,-71.08546447753906,17.600000381469727,328204.28125,4689573.5,19,T
1644452648.28059,[-----GPS DATA-----],42.33945846557617,-71.08546447753906,17.600000381469727,328204.0,4689573.5,19,T
1644452649.2815514,[-----GPS DATA-----],42.339454650878906,-71.0854721069336,17.600000381469727,328203.84375,4689573.0,19,T
1644452650.3437662,[-----GPS DATA-----],42.339454650878906,-71.0854721069336,17.600000381469727,328203.59375,4689572.5,19,T
1644452651.2821212,[-----GPS DATA-----],42.33945083618164,-71.0854721069336,17.600000381469727,328203.28125,4689572.5,19,T
1644452652.283192,[-----GPS DATA-----],42.339447021484375,-71.08547973632812,17.600000381469727,328203.0,4689572.0,19,T
1644452653.2845137,[-----GPS DATA-----],42.33944320678711,-71.08547973632812,17.5,328202.71875,4689572.0,19,T
1644452654.2793174,[-----GPS DATA-----],42.33944320678711,-71.08548736572266,17.5,328202.4375,4689571.5,19,T
1644452655.342121,[-----GPS DATA-----],42.339439392089844,-71.08548736572266,17.5,328202.15625,4689571.5,19,T
1644452656.2820184,[-----GPS DATA-----],42.33943557739258,-71.08549499511719,17.5,328201.875,4689571.0,19,T
1644452657.2807121,[-----GPS DATA-----],42.33943176269531,-71.08549499511719,17.399999618530273,328201.59375,4689570.5,19,T
1644452658.2836995,[-----GPS DATA-----],42.33943176269531,-71.08549499511719,17.5,328201.3125,4689570.5,19,T
1644452659.2821772,[-----GPS DATA-----],42.33942794799805,-71.08550262451172,17.5,328201.03125,4689570.0,19,T
1644452660.3462744,[-----GPS DATA-----],42.33942413330078,-71.08550262451172,17.399999618530273,328200.75,4689569.5,19,T
1644452661.28145,[-----GPS DATA-----],42.339420318603516,-71.08551025390625,17.399999618530273,328200.46875,4689569.5,19,T
1644452662.2791545,[-----GPS DATA-----],42.33941650390625,-71.08551025390625,17.399999618530273,328200.1875,4689569.0,19,T
1644452663.284712,[-----GPS DATA-----],42.33941650390625,-71.08551788330078,17.399999618530273,328199.90625,4689568.5,19,T
1644452664.298483,[-----GPS DATA-----],42.339412689208984,-71.08551788330078,17.399999618530273,328199.625,4689568.0,19,T
1644452665.3604734,[-----GPS DATA-----],42.33940887451172,-71.08551788330078,17.299999237060547,328199.34375,4689568.0,19,T
1644452666.279435,[-----GPS DATA-----],42.33940505981445,-71.08552551269531,17.299999237060547,328199.1875,4689567.5,19,T
1644452667.281303,[-----GPS DATA-----],42.33940124511719,-71.08552551269531,17.200000762939453,328198.90625,4689567.0,19,T
1644452668.3029711,[-----GPS DATA-----],42.33940124511719,-71.08553314208984,17.200000762939453,328198.5,4689567.0,19,T
1644452669.281623,[-----GPS DATA-----],42.33939743041992,-71.08553314208984,17.100000381469727,328198.21875,4689566.5,19,T
1644452670.3434768,[-----GPS DATA-----],42.339393615722656,-71.08554077148438,17.0,328197.78125,4689566.0,19,T
1644452671.282275,[-----GPS DATA-----],42.33938980102539,-71.08554077148438,17.0,328197.5,4689566.0,19,T
1644452672.2814705,[-----GPS DATA-----],42.339385986328125,-71.0855484008789,17.0,328197.21875,4689565.5,19,T
1644452673.2816312,[-----GPS DATA-----],42.33938217163086,-71.0855484008789,17.100000381469727,328196.8125,4689565.0,19,T
1644452674.2964375,[-----GPS DATA-----],42.339378356933594,-71.08555603027344,17.100000381469727,328196.5,4689565.0,19,T
1644452675.3588536,[-----GPS DATA-----],42.339378356933594,-71.08556365966797,17.200000762939453,328196.09375,4689564.5,19,T
1644452676.282774,[-----GPS DATA-----],42.33937072753906,-71.08556365966797,17.200000762939453,328195.8125,4689564.0,19,T
1644452677.281378,[-----GPS DATA-----],42.3393669128418,-71.08556365966797,17.200000762939453,328195.53125,4689563.5,19,T
1644452678.279826,[-----GPS DATA-----],42.33936309814453,-71.0855712890625,17.200000762939453,328195.09375,4689563.0,19,T
1644452679.2815418,[-----GPS DATA-----],42.33936309814453,-71.0855712890625,17.200000762939453,328194.8125,4689563.0,19,T
1644452680.344044,[-----GPS DATA-----],42.339359283447266,-71.08557891845703,17.200000762939453,328194.40625,4689562.5,19,T
1644452681.2810366,[-----GPS DATA-----],42.33935546875,-71.08558654785156,17.299999237060547,328194.125,4689562.0,19,T
1644452682.2801418,[-----GPS DATA-----],42.339351654052734,-71.08558654785156,17.299999237060547,328193.6875,4689561.5,19,T
1644452683.2848835,[-----GPS DATA-----],42.33934783935547,-71.0855941772461,17.299999237060547,328193.40625,4689561.0,19,T
1644452684.2816396,[-----GPS DATA-----],42.3393440246582,-71.0855941772461,17.299999237060547,328192.96875,4689561.0,19,T
1644452685.3432782,[-----GPS DATA-----],42.33934020996094,-71.08560180664062,17.299999237060547,328192.6875,4689560.5,19,T
1644452686.281371,[-----GPS DATA-----],42.33933639526367,-71.08560180664062,17.200000762939453,328192.40625,4689560.0,19,T
1644452687.2817852,[-----GPS DATA-----],42.339332580566406,-71.08560943603516,17.200000762939453,328192.0,4689559.5,19,T
1644452688.2861097,[-----GPS DATA-----],42.33932876586914,-71.08561706542969,17.100000381469727,328191.5625,4689559.0,19,T
1644452689.2812183,[-----GPS DATA-----],42.339324951171875,-71.08561706542969,17.0,328191.28125,4689559.0,19,T
1644452690.3434768,[-----GPS DATA-----],42.33932113647461,-71.08562469482422,16.899999618530273,328190.875,4689558.5,19,T
1644452691.2821927,[-----GPS DATA-----],42.339317321777344,-71.08562469482422,16.899999618530273,328190.59375,4689558.0,19,T
1644452692.2820354,[-----GPS DATA-----],42.33931350708008,-71.08563232421875,16.899999618530273,328190.15625,4689557.5,19,T
1644452693.2847345,[-----GPS DATA-----],42.33930969238281,-71.08563232421875,16.799999237060547,328189.71875,4689557.0,19,T
1644452694.2798183,[-----GPS DATA-----],42.33930969238281,-71.08563995361328,16.700000762939453,328189.3125,4689557.0,19,T
1644452695.3425238,[-----GPS DATA-----],42.33930206298828,-71.08564758300781,16.700000762939453,328188.90625,4689556.5,19,T
1644452696.2821066,[-----GPS DATA-----],42.339298248291016,-71.08564758300781,16.700000762939453,328188.46875,4689556.0,19,T
1644452697.2817323,[-----GPS DATA-----],42.339298248291016,-71.08565521240234,16.5,328188.1875,4689556.0,19,T
1644452698.2832124,[-----GPS DATA-----],42.33929443359375,-71.08565521240234,16.399999618530273,328187.90625,4689555.5,19,T
1644452699.2822561,[-----GPS DATA-----],42.339290618896484,-71.08566284179688,16.399999618530273,328187.5,4689555.0,19,T
1644452700.3445795,[-----GPS DATA-----],42.339290618896484,-71.08566284179688,16.399999618530273,328187.21875,4689555.0,19,T
1644452701.2820072,[-----GPS DATA-----],42.33928680419922,-71.0856704711914,16.299999237060547,328186.78125,4689554.5,19,T
1644452702.2798905,[-----GPS DATA-----],42.33928298950195,-71.0856704711914,16.200000762939453,328186.5,4689554.5,19,T
1644452703.2824206,[-----GPS DATA-----],42.33927917480469,-71.08567810058594,16.200000762939453,328186.09375,4689554.0,19,T
1644452704.2818282,[-----GPS DATA-----],42.33927536010742,-71.08567810058594,16.100000381469727,328185.8125,4689553.5,19,T
1644452705.343748,[-----GPS DATA-----],42.339271545410156,-71.08568572998047,16.0,328185.5,4689553.0,19,T
1644452706.2804906,[-----GPS DATA-----],42.339271545410156,-71.08568572998047,16.299999237060547,328185.375,4689553.0,19,T
1644452707.2860725,[-----GPS DATA-----],42.33926773071289,-71.085693359375,16.399999618530273,328185.09375,4689552.5,19,T
1644452708.2823565,[-----GPS DATA-----],42.339263916015625,-71.085693359375,16.600000381469727,328184.9375,4689552.5,19,T
1644452709.2813706,[-----GPS DATA-----],42.33926010131836,-71.085693359375,16.700000762939453,328184.65625,4689552.0,19,T
1644452710.3440435,[-----GPS DATA-----],42.33926010131836,-71.08570098876953,16.799999237060547,328184.375,4689551.5,19,T
1644452711.2821531,[-----GPS DATA-----],42.339256286621094,-71.08570098876953,16.799999237060547,328184.21875,4689551.0,19,T
1644452712.2855253,[-----GPS DATA-----],42.33925247192383,-71.08570098876953,16.899999618530273,328184.09375,4689551.0,19,T
1644452713.2821069,[-----GPS DATA-----],42.3392448425293,-71.08570861816406,17.100000381469727,328183.78125,4689550.5,19,T
1644452714.280335,[-----GPS DATA-----],42.3392448425293,-71.08570861816406,17.100000381469727,328183.5,4689550.0,19,T
1644452715.3432007,[-----GPS DATA-----],42.33924102783203,-71.08570861816406,16.799999237060547,328183.21875,4689549.5,19,T
1644452716.2827067,[-----GPS DATA-----],42.339237213134766,-71.0857162475586,16.700000762939453,328182.8125,4689549.5,19,T
1644452717.2817912,[-----GPS DATA-----],42.339237213134766,-71.0857162475586,16.600000381469727,328182.53125,4689549.0,19,T
1644452718.2806237,[-----GPS DATA-----],42.3392333984375,-71.08572387695312,16.600000381469727,328182.125,4689549.0,19,T
1644452719.3023872,[-----GPS DATA-----],42.339229583740234,-71.08573150634766,16.600000381469727,328181.6875,4689548.5,19,T
1644452720.3640716,[-----GPS DATA-----],42.339229583740234,-71.08573150634766,16.600000381469727,328181.40625,4689548.5,19,T
1644452721.2810307,[-----GPS DATA-----],42.33922576904297,-71.08573913574219,16.5,328181.0,4689548.0,19,T
1644452722.279562,[-----GPS DATA-----],42.3392219543457,-71.08573913574219,16.399999618530273,328180.71875,4689547.5,19,T
1644452723.2818246,[-----GPS DATA-----],42.33921813964844,-71.08574676513672,16.299999237060547,328180.28125,4689547.0,19,T
1644452724.2825758,[-----GPS DATA-----],42.33921432495117,-71.08574676513672,16.100000381469727,328180.0,4689547.0,19,T
1644452725.3444264,[-----GPS DATA-----],42.339210510253906,-71.08575439453125,16.0,328179.59375,4689546.5,19,T
1644452726.2970145,[-----GPS DATA-----],42.33920669555664,-71.08576202392578,16.299999237060547,328179.28125,4689546.0,19,T
1644452727.282786,[-----GPS DATA-----],42.33920669555664,-71.08576202392578,16.799999237060547,328179.0,4689546.0,19,T
1644452728.2826567,[-----GPS DATA-----],42.339202880859375,-71.08576965332031,16.799999237060547,328178.59375,4689545.5,19,T
1644452729.2832325,[-----GPS DATA-----],42.33919906616211,-71.08576965332031,16.899999618530273,328178.15625,4689545.0,19,T
1644452730.3443055,[-----GPS DATA-----],42.339195251464844,-71.08577728271484,17.0,328177.875,4689544.5,19,T
1644452731.2826838,[-----GPS DATA-----],42.33919143676758,-71.08577728271484,17.100000381469727,328177.46875,4689544.5,19,T
1644452732.2819014,[-----GPS DATA-----],42.33918762207031,-71.08578491210938,17.200000762939453,328177.1875,4689544.0,19,T
1644452733.2815185,[-----GPS DATA-----],42.33918380737305,-71.08578491210938,17.399999618530273,328176.75,4689543.5,19,T
1644452734.2803833,[-----GPS DATA-----],42.33917999267578,-71.0857925415039,17.5,328176.34375,4689543.0,19,T
1644452735.3428817,[-----GPS DATA-----],42.339176177978516,-71.08580017089844,17.5,328176.0625,4689542.5,19,T
1644452736.2831376,[-----GPS DATA-----],42.33917236328125,-71.08580017089844,17.600000381469727,328175.78125,4689542.5,19,T
1644452737.2806585,[-----GPS DATA-----],42.339168548583984,-71.08580017089844,17.600000381469727,328175.5,4689542.0,19,T
1644452738.279442,[-----GPS DATA-----],42.339168548583984,-71.08580780029297,17.700000762939453,328175.1875,4689541.5,19,T
1644452739.2816432,[-----GPS DATA-----],42.33916473388672,-71.08580780029297,17.799999237060547,328174.90625,4689541.0,19,T
1644452740.3440273,[-----GPS DATA-----],42.33916091918945,-71.0858154296875,17.799999237060547,328174.625,4689541.0,19,T
1644452741.2810202,[-----GPS DATA-----],42.33915710449219,-71.0858154296875,17.700000762939453,328174.21875,4689540.5,19,T
1644452742.2809143,[-----GPS DATA-----],42.33915328979492,-71.08582305908203,17.600000381469727,328173.9375,4689540.0,19,T
1644452743.2819645,[-----GPS DATA-----],42.33915328979492,-71.08582305908203,17.700000762939453,328173.65625,4689540.0,19,T
1644452744.281689,[-----GPS DATA-----],42.339149475097656,-71.08583068847656,17.799999237060547,328173.375,4689539.5,19,T
1644452745.3439534,[-----GPS DATA-----],42.33914566040039,-71.08583068847656,17.799999237060547,328173.09375,4689539.0,19,T
1644452746.2800052,[-----GPS DATA-----],42.339141845703125,-71.0858383178711,17.799999237060547,328172.65625,4689539.0,19,T
1644452747.2820766,[-----GPS DATA-----],42.339141845703125,-71.0858383178711,18.0,328172.53125,4689538.5,19,T
1644452748.2828097,[-----GPS DATA-----],42.33913803100586,-71.08584594726562,18.200000762939453,328172.09375,4689538.5,19,T
1644452749.2812417,[-----GPS DATA-----],42.339134216308594,-71.08584594726562,18.399999618530273,328171.6875,4689538.0,19,T
1644452750.3422542,[-----GPS DATA-----],42.33913040161133,-71.08585357666016,18.399999618530273,328171.40625,4689537.5,19,T
1644452751.2849977,[-----GPS DATA-----],42.33912658691406,-71.08585357666016,18.5,328170.96875,4689537.5,19,T
1644452752.282762,[-----GPS DATA-----],42.33912658691406,-71.08586120605469,18.600000381469727,328170.6875,4689537.0,19,T
1644452753.2820446,[-----GPS DATA-----],42.3391227722168,-71.08586120605469,18.700000762939453,328170.40625,4689536.5,19,T
1644452754.280501,[-----GPS DATA-----],42.33911895751953,-71.08586120605469,18.899999618530273,328170.28125,4689536.5,19,T
1644452755.3431597,[-----GPS DATA-----],42.339115142822266,-71.08586883544922,19.100000381469727,328170.0,4689536.0,19,T
1644452756.2823536,[-----GPS DATA-----],42.339115142822266,-71.08586883544922,19.200000762939453,328169.6875,4689536.0,19,T
1644452757.281433,[-----GPS DATA-----],42.339111328125,-71.08587646484375,19.399999618530273,328169.40625,4689535.5,19,T
1644452758.2795079,[-----GPS DATA-----],42.339107513427734,-71.08587646484375,19.5,328169.125,4689535.0,19,T
1644452759.2815511,[-----GPS DATA-----],42.33910369873047,-71.08588409423828,19.600000381469727,328168.71875,4689534.5,19,T
1644452760.3434808,[-----GPS DATA-----],42.3390998840332,-71.08588409423828,19.700000762939453,328168.4375,4689534.5,19,T
1644452761.2816727,[-----GPS DATA-----],42.33909606933594,-71.08589172363281,19.700000762939453,328168.15625,4689534.0,19,T
1644452762.2794125,[-----GPS DATA-----],42.33909225463867,-71.08589172363281,19.799999237060547,328167.71875,4689533.5,19,T
1644452763.28234,[-----GPS DATA-----],42.339088439941406,-71.08589935302734,19.899999618530273,328167.4375,4689533.5,19,T
1644452764.285128,[-----GPS DATA-----],42.339088439941406,-71.08590698242188,20.0,328167.03125,4689533.0,19,T
1644452765.3471546,[-----GPS DATA-----],42.33908462524414,-71.08590698242188,20.100000381469727,328166.59375,4689532.5,19,T
1644452766.2799141,[-----GPS DATA-----],42.339080810546875,-71.0859146118164,20.200000762939453,328166.3125,4689532.0,19,T
1644452767.2820718,[-----GPS DATA-----],42.33907699584961,-71.0859146118164,20.200000762939453,328166.03125,4689532.0,19,T
1644452768.28128,[-----GPS DATA-----],42.339073181152344,-71.0859146118164,20.200000762939453,328165.75,4689531.5,19,T
1644452769.2813354,[-----GPS DATA-----],42.33906936645508,-71.08592224121094,20.299999237060547,328165.3125,4689531.0,19,T
1644452770.3468335,[-----GPS DATA-----],42.33906555175781,-71.08592987060547,20.399999618530273,328165.03125,4689530.5,19,T
1644452771.2831166,[-----GPS DATA-----],42.33906173706055,-71.08592987060547,20.399999618530273,328164.75,4689530.5,19,T
1644452772.2826989,[-----GPS DATA-----],42.33906173706055,-71.08592987060547,20.399999618530273,328164.46875,4689530.0,19,T
1644452773.2825806,[-----GPS DATA-----],42.33905792236328,-71.0859375,20.299999237060547,328164.0625,4689529.5,19,T
1644452774.2797241,[-----GPS DATA-----],42.339054107666016,-71.08594512939453,20.299999237060547,328163.78125,4689529.5,19,T
1644452775.343287,[-----GPS DATA-----],42.33905029296875,-71.08594512939453,20.200000762939453,328163.5,4689529.0,19,T
1644452776.298651,[-----GPS DATA-----],42.339046478271484,-71.08595275878906,20.100000381469727,328163.0625,4689528.5,19,T
1644452777.2808592,[-----GPS DATA-----],42.33904266357422,-71.08595275878906,20.100000381469727,328162.65625,4689528.0,19,T
1644452778.279976,[-----GPS DATA-----],42.33903884887695,-71.0859603881836,20.0,328162.375,4689528.0,19,T
1644452779.2825034,[-----GPS DATA-----],42.33903503417969,-71.0859603881836,20.0,328162.0625,4689527.5,19,T
1644452780.343643,[-----GPS DATA-----],42.33903503417969,-71.08596801757812,19.899999618530273,328161.65625,4689527.0,19,T
1644452781.282177,[-----GPS DATA-----],42.33903121948242,-71.08596801757812,19.799999237060547,328161.375,4689526.5,19,T
1644452782.2833846,[-----GPS DATA-----],42.339027404785156,-71.08597564697266,19.700000762939453,328160.9375,4689526.5,19,T
1644452783.2821681,[-----GPS DATA-----],42.33902359008789,-71.08597564697266,19.399999618530273,328160.65625,4689526.0,19,T
1644452784.2818592,[-----GPS DATA-----],42.339019775390625,-71.08598327636719,19.299999237060547,328160.25,4689525.5,19,T
1644452785.343652,[-----GPS DATA-----],42.33901596069336,-71.08598327636719,19.399999618530273,328159.96875,4689525.0,19,T
1644452786.278948,[-----GPS DATA-----],42.339012145996094,-71.08599090576172,19.600000381469727,328159.6875,4689525.0,19,T
1644452787.2839966,[-----GPS DATA-----],42.33900833129883,-71.08599853515625,19.700000762939453,328159.25,4689524.5,19,T
1644452788.282194,[-----GPS DATA-----],42.33900451660156,-71.08599853515625,19.600000381469727,328158.96875,4689524.0,19,T
1644452789.281187,[-----GPS DATA-----],42.3390007019043,-71.08599853515625,19.899999618530273,328158.6875,4689523.5,19,T
1644452790.3436499,[-----GPS DATA-----],42.33899688720703,-71.08600616455078,20.0,328158.25,4689523.0,19,T
1644452791.2812598,[-----GPS DATA-----],42.338993072509766,-71.08601379394531,20.0,328157.84375,4689522.5,19,T
1644452792.2810469,[-----GPS DATA-----],42.3389892578125,-71.08601379394531,19.899999618530273,328157.40625,4689522.0,19,T
1644452793.2807071,[-----GPS DATA-----],42.338985443115234,-71.08602142333984,19.899999618530273,328157.0,4689522.0,19,T
1644452794.2808843,[-----GPS DATA-----],42.33898162841797,-71.08602142333984,19.899999618530273,328156.71875,4689521.5,19,T
1644452795.3470988,[-----GPS DATA-----],42.3389778137207,-71.08602905273438,20.0,328156.28125,4689521.0,19,T
1644452796.282013,[-----GPS DATA-----],42.33897399902344,-71.0860366821289,20.0,328155.875,4689520.5,19,T
1644452797.2813277,[-----GPS DATA-----],42.33897018432617,-71.0860366821289,19.899999618530273,328155.59375,4689520.0,19,T
1644452798.2799075,[-----GPS DATA-----],42.338966369628906,-71.08604431152344,19.899999618530273,328155.3125,4689520.0,19,T
1644452799.2822902,[-----GPS DATA-----],42.33896255493164,-71.08604431152344,20.100000381469727,328155.0,4689519.5,19,T
1644452800.3476796,[-----GPS DATA-----],42.338958740234375,-71.08605194091797,20.0,328154.59375,4689519.0,19,T
1644452801.2813873,[-----GPS DATA-----],42.33895492553711,-71.08605194091797,20.0,328154.3125,4689519.0,19,T
1644452802.28021,[-----GPS DATA-----],42.33895492553711,-71.0860595703125,20.100000381469727,328153.875,4689518.5,19,T
1644452803.280786,[-----GPS DATA-----],42.33894729614258,-71.0860595703125,20.799999237060547,328153.46875,4689518.0,19,T
1644452804.2821338,[-----GPS DATA-----],42.33894348144531,-71.08606719970703,21.299999237060547,328153.1875,4689517.5,19,T
1644452805.343656,[-----GPS DATA-----],42.33893966674805,-71.08607482910156,21.899999618530273,328152.75,4689517.0,19,T
1644452806.2811644,[-----GPS DATA-----],42.33893585205078,-71.08607482910156,22.200000762939453,328152.46875,4689516.5,19,T
1644452807.281559,[-----GPS DATA-----],42.338932037353516,-71.0860824584961,22.299999237060547,328152.03125,4689516.0,19,T
1644452808.282978,[-----GPS DATA-----],42.33892822265625,-71.0860824584961,22.600000381469727,328151.75,4689515.5,19,T
1644452809.2808676,[-----GPS DATA-----],42.338924407958984,-71.08609008789062,23.0,328151.46875,4689515.0,19,T
1644452810.3470476,[-----GPS DATA-----],42.33891677856445,-71.08609008789062,23.399999618530273,328151.03125,4689514.5,19,T
1644452811.2817118,[-----GPS DATA-----],42.33891677856445,-71.08609771728516,23.799999237060547,328150.75,4689514.0,19,T
1644452812.2820282,[-----GPS DATA-----],42.33891296386719,-71.08609771728516,24.100000381469727,328150.34375,4689514.0,19,T
1644452813.2806747,[-----GPS DATA-----],42.33890914916992,-71.08610534667969,24.299999237060547,328150.0625,4689513.5,19,T
1644452814.2796633,[-----GPS DATA-----],42.33890151977539,-71.08610534667969,24.299999237060547,328149.78125,4689513.0,19,T
1644452815.3423073,[-----GPS DATA-----],42.33890151977539,-71.08611297607422,24.299999237060547,328149.5,4689513.0,19,T
1644452816.298672,[-----GPS DATA-----],42.338897705078125,-71.08611297607422,24.399999618530273,328149.0625,4689512.0,19,T
1644452817.2846084,[-----GPS DATA-----],42.33889389038086,-71.08612060546875,24.5,328148.78125,4689512.0,19,T
1644452818.2796738,[-----GPS DATA-----],42.338890075683594,-71.08612060546875,24.700000762939453,328148.5,4689511.5,19,T
1644452819.281355,[-----GPS DATA-----],42.33888626098633,-71.08612060546875,24.700000762939453,328148.34375,4689511.0,19,T
1644452820.3439145,[-----GPS DATA-----],42.33888244628906,-71.08612823486328,24.700000762939453,328148.21875,4689511.0,19,T
1644452821.2968364,[-----GPS DATA-----],42.3388786315918,-71.08612823486328,24.600000381469727,328147.90625,4689510.5,19,T
1644452822.2820866,[-----GPS DATA-----],42.33887481689453,-71.08612823486328,25.0,328147.78125,4689510.0,19,T
1644452823.2808428,[-----GPS DATA-----],42.338871002197266,-71.08612823486328,25.100000381469727,328147.625,4689509.5,19,T
1644452824.2794564,[-----GPS DATA-----],42.3388671875,-71.08613586425781,25.100000381469727,328147.34375,4689509.0,19,T
1644452825.3413324,[-----GPS DATA-----],42.338863372802734,-71.08614349365234,24.899999618530273,328146.90625,4689509.0,19,T
1644452826.2957945,[-----GPS DATA-----],42.338863372802734,-71.08614349365234,24.600000381469727,328146.625,4689508.5,19,T
1644452827.3022208,[-----GPS DATA-----],42.33885955810547,-71.08614349365234,24.5,328146.34375,4689508.0,19,T
1644452828.2867851,[-----GPS DATA-----],42.3388557434082,-71.08615112304688,24.399999618530273,328145.9375,4689507.5,19,T
1644452829.2806728,[-----GPS DATA-----],42.33884811401367,-71.0861587524414,24.299999237060547,328145.5,4689507.0,19,T
1644452830.3425863,[-----GPS DATA-----],42.33884811401367,-71.0861587524414,24.100000381469727,328145.21875,4689507.0,19,T
1644452831.280131,[-----GPS DATA-----],42.33884048461914,-71.08616638183594,24.100000381469727,328144.78125,4689506.0,19,T
1644452832.2807035,[-----GPS DATA-----],42.338836669921875,-71.08617401123047,24.0,328144.21875,4689505.5,19,T
1644452833.2794597,[-----GPS DATA-----],42.33883285522461,-71.08617401123047,24.100000381469727,328143.8125,4689505.0,19,T
1644452834.2818427,[-----GPS DATA-----],42.338829040527344,-71.086181640625,23.899999618530273,328143.53125,4689505.0,19,T
1644452835.3440657,[-----GPS DATA-----],42.33883285522461,-71.08618927001953,23.799999237060547,328143.0,4689505.5,19,T
1644452836.280157,[-----GPS DATA-----],42.338829040527344,-71.08619689941406,23.799999237060547,328142.4375,4689505.0,19,T
1644452837.2799213,[-----GPS DATA-----],42.338829040527344,-71.08619689941406,23.899999618530273,328142.03125,4689505.0,19,T
1644452838.2792685,[-----GPS DATA-----],42.33882522583008,-71.0862045288086,24.0,328141.59375,4689504.5,19,T
1644452839.281228,[-----GPS DATA-----],42.33882522583008,-71.0862045288086,24.0,328141.3125,4689504.5,19,T
1644452840.343476,[-----GPS DATA-----],42.33882141113281,-71.08621215820312,24.299999237060547,328140.90625,4689504.0,19,T
1644452841.2804093,[-----GPS DATA-----],42.33882141113281,-71.08621215820312,24.600000381469727,328140.625,4689504.0,19,T
1644452842.2792454,[-----GPS DATA-----],42.33882141113281,-71.08621978759766,24.899999618530273,328140.34375,4689504.0,19,T
1644452843.2801583,[-----GPS DATA-----],42.33882141113281,-71.08621978759766,25.200000762939453,328140.21875,4689504.0,19,T
1644452844.2842486,[-----GPS DATA-----],42.33882522583008,-71.08621978759766,25.399999618530273,328139.9375,4689504.5,19,T
1644452845.3464277,[-----GPS DATA-----],42.338829040527344,-71.08622741699219,25.5,328139.6875,4689505.0,19,T
1644452846.2788994,[-----GPS DATA-----],42.33883285522461,-71.08622741699219,25.600000381469727,328139.5625,4689505.0,19,T
1644452847.2807496,[-----GPS DATA-----],42.338836669921875,-71.08623504638672,25.600000381469727,328139.28125,4689506.0,19,T
1644452848.280457,[-----GPS DATA-----],42.338836669921875,-71.08623504638672,25.600000381469727,328139.0,4689505.5,19,T
1644452849.2799122,[-----GPS DATA-----],42.338836669921875,-71.08623504638672,25.700000762939453,328138.75,4689505.5,19,T
1644452850.3423033,[-----GPS DATA-----],42.338836669921875,-71.08624267578125,25.700000762939453,328138.59375,4689506.0,19,T
1644452851.280059,[-----GPS DATA-----],42.338844299316406,-71.08624267578125,25.899999618530273,328138.34375,4689506.5,19,T
1644452852.2801967,[-----GPS DATA-----],42.33884811401367,-71.08624267578125,26.0,328138.21875,4689507.0,19,T
1644452853.2797613,[-----GPS DATA-----],42.33884811401367,-71.08625030517578,26.200000762939453,328137.96875,4689507.5,19,T
1644452854.2785792,[-----GPS DATA-----],42.33885192871094,-71.08625030517578,26.399999618530273,328137.8125,4689507.5,19,T
1644452855.340678,[-----GPS DATA-----],42.3388557434082,-71.08625030517578,26.600000381469727,328137.6875,4689508.0,19,T
1644452856.281023,[-----GPS DATA-----],42.3388557434082,-71.08625030517578,26.600000381469727,328137.5625,4689508.0,19,T
1644452857.2796054,[-----GPS DATA-----],42.33885955810547,-71.08625793457031,26.5,328137.4375,4689508.5,19,T
1644452858.2791495,[-----GPS DATA-----],42.33885955810547,-71.08625793457031,26.5,328137.15625,4689508.5,19,T
1644452859.2809622,[-----GPS DATA-----],42.3388557434082,-71.08625793457031,26.600000381469727,328136.875,4689508.0,19,T
1644452860.343173,[-----GPS DATA-----],42.33885192871094,-71.08626556396484,26.600000381469727,328136.59375,4689507.5,19,T
1644452861.2806187,[-----GPS DATA-----],42.33884811401367,-71.08627319335938,26.600000381469727,328136.15625,4689507.0,19,T
1644452862.2803013,[-----GPS DATA-----],42.33884811401367,-71.08627319335938,26.5,328135.875,4689507.0,19,T
1644452863.2809541,[-----GPS DATA-----],42.33884811401367,-71.08627319335938,26.5,328135.625,4689507.5,19,T
1644452864.2806494,[-----GPS DATA-----],42.33885955810547,-71.0862808227539,26.399999618530273,328135.5,4689508.5,19,T
1644452865.3425028,[-----GPS DATA-----],42.338863372802734,-71.0862808227539,26.299999237060547,328135.25,4689508.5,19,T
1644452866.2793255,[-----GPS DATA-----],42.338863372802734,-71.08628845214844,26.200000762939453,328134.96875,4689509.0,19,T
1644452867.2970893,[-----GPS DATA-----],42.3388671875,-71.08628845214844,26.100000381469727,328134.71875,4689509.5,19,T
1644452868.2808614,[-----GPS DATA-----],42.338863372802734,-71.08629608154297,26.0,328134.28125,4689509.0,19,T
1644452869.280015,[-----GPS DATA-----],42.33885955810547,-71.08629608154297,25.899999618530273,328134.0,4689508.5,19,T
1644452870.3423994,[-----GPS DATA-----],42.33885192871094,-71.0863037109375,25.799999237060547,328133.71875,4689508.0,19,T
1644452871.2987835,[-----GPS DATA-----],42.33884811401367,-71.0863037109375,25.700000762939453,328133.28125,4689507.5,19,T
1644452872.2804039,[-----GPS DATA-----],42.33884811401367,-71.08631134033203,25.600000381469727,328133.0,4689507.0,19,T
1644452873.2800934,[-----GPS DATA-----],42.338844299316406,-71.08631134033203,25.600000381469727,328132.59375,4689507.0,19,T
1644452874.279853,[-----GPS DATA-----],42.33884048461914,-71.08631896972656,25.700000762939453,328132.15625,4689506.5,19,T
1644452875.3421075,[-----GPS DATA-----],42.338836669921875,-71.0863265991211,25.700000762939453,328131.75,4689506.0,19,T
1644452876.2788484,[-----GPS DATA-----],42.338836669921875,-71.0863265991211,25.700000762939453,328131.3125,4689506.0,19,T
1644452877.2965596,[-----GPS DATA-----],42.338829040527344,-71.08633422851562,25.700000762939453,328130.90625,4689505.5,19,T
1644452878.2978916,[-----GPS DATA-----],42.33882522583008,-71.08634185791016,25.799999237060547,328130.34375,4689504.5,19,T
1644452879.2806363,[-----GPS DATA-----],42.33881378173828,-71.08634948730469,25.799999237060547,328129.75,4689503.5,19,T
1644452880.342768,[-----GPS DATA-----],42.338802337646484,-71.08634948730469,25.799999237060547,328129.3125,4689502.5,19,T
1644452881.2804346,[-----GPS DATA-----],42.33879852294922,-71.08635711669922,25.700000762939453,328129.03125,4689502.0,19,T
1644452882.2790928,[-----GPS DATA-----],42.33879852294922,-71.08635711669922,25.700000762939453,328128.625,4689502.0,19,T
1644452883.2806573,[-----GPS DATA-----],42.338802337646484,-71.08636474609375,25.799999237060547,328128.0625,4689502.5,19,T
1644452884.281756,[-----GPS DATA-----],42.338802337646484,-71.08637237548828,25.799999237060547,328127.65625,4689502.5,19,T
1644452885.3433187,[-----GPS DATA-----],42.338802337646484,-71.08638000488281,25.799999237060547,328127.25,4689502.0,19,T
1644452886.2796674,[-----GPS DATA-----],42.33879852294922,-71.08638000488281,25.899999618530273,328126.84375,4689502.0,19,T
1644452887.2805583,[-----GPS DATA-----],42.33879852294922,-71.08638763427734,25.899999618530273,328126.28125,4689501.5,19,T
1644452888.2805495,[-----GPS DATA-----],42.33879852294922,-71.08639526367188,26.100000381469727,328125.59375,4689501.5,19,T
1644452889.28029,[-----GPS DATA-----],42.338783264160156,-71.0864028930664,26.299999237060547,328125.0,4689500.5,19,T
1644452890.3425376,[-----GPS DATA-----],42.338775634765625,-71.08641052246094,26.5,328124.3125,4689499.5,19,T
1644452891.278118,[-----GPS DATA-----],42.338768005371094,-71.08641815185547,26.799999237060547,328123.59375,4689498.5,19,T
1644452892.2807102,[-----GPS DATA-----],42.33876419067383,-71.08642578125,26.899999618530273,328123.03125,4689498.0,19,T
1644452893.279529,[-----GPS DATA-----],42.3387565612793,-71.08643341064453,27.0,328122.3125,4689497.5,19,T
1644452894.2799563,[-----GPS DATA-----],42.3387565612793,-71.08644104003906,27.100000381469727,328121.90625,4689497.0,19,T
1644452895.3428369,[-----GPS DATA-----],42.33875274658203,-71.08644104003906,27.100000381469727,328121.75,4689497.0,19,T
1644452896.2816932,[-----GPS DATA-----],42.3387451171875,-71.0864486694336,27.100000381469727,328121.34375,4689496.0,19,T
1644452897.2842655,[-----GPS DATA-----],42.3387451171875,-71.0864486694336,27.100000381469727,328120.90625,4689496.0,19,T
1644452898.2790484,[-----GPS DATA-----],42.338741302490234,-71.08645629882812,27.100000381469727,328120.625,4689495.5,19,T
1644452899.280471,[-----GPS DATA-----],42.33873748779297,-71.08645629882812,27.200000762939453,328120.21875,4689495.0,19,T
1644452900.3426046,[-----GPS DATA-----],42.33872985839844,-71.08646392822266,27.100000381469727,328119.90625,4689494.5,19,T
1644452901.280082,[-----GPS DATA-----],42.33872604370117,-71.08647155761719,27.0,328119.5,4689494.0,19,T
1644452902.283352,[-----GPS DATA-----],42.338722229003906,-71.08647155761719,27.0,328119.34375,4689493.5,19,T
1644452903.2812107,[-----GPS DATA-----],42.338714599609375,-71.08647155761719,26.899999618530273,328118.90625,4689493.0,19,T
1644452904.2825127,[-----GPS DATA-----],42.338714599609375,-71.08647918701172,26.799999237060547,328118.5,4689492.5,19,T
1644452905.344627,[-----GPS DATA-----],42.33871078491211,-71.08648681640625,26.700000762939453,328118.09375,4689492.5,19,T
1644452906.2782524,[-----GPS DATA-----],42.338706970214844,-71.08648681640625,26.700000762939453,328117.65625,4689492.0,19,T
1644452907.2813594,[-----GPS DATA-----],42.33870315551758,-71.08649444580078,26.700000762939453,328117.21875,4689491.5,19,T
1644452908.2812624,[-----GPS DATA-----],42.33869552612305,-71.08650207519531,26.700000762939453,328116.65625,4689490.5,19,T
1644452909.2807333,[-----GPS DATA-----],42.33868408203125,-71.08650207519531,26.600000381469727,328116.34375,4689489.5,19,T
1644452910.342867,[-----GPS DATA-----],42.338680267333984,-71.08650970458984,26.600000381469727,328115.9375,4689489.0,19,T
1644452911.283526,[-----GPS DATA-----],42.338680267333984,-71.08650970458984,26.5,328115.65625,4689489.0,19,T
1644452912.2807093,[-----GPS DATA-----],42.33867645263672,-71.08651733398438,26.399999618530273,328115.25,4689488.5,19,T
1644452913.2777596,[-----GPS DATA-----],42.33866882324219,-71.08651733398438,26.399999618530273,328115.09375,4689488.0,19,T
1644452914.2766166,[-----GPS DATA-----],42.33866500854492,-71.0865249633789,26.200000762939453,328114.9375,4689487.5,19,T
1644452915.338951,[-----GPS DATA-----],42.338653564453125,-71.0865249633789,26.0,328114.625,4689486.0,19,T
1644452916.2773395,[-----GPS DATA-----],42.33864974975586,-71.0865249633789,26.0,328114.46875,4689485.5,19,T
1644452917.294812,[-----GPS DATA-----],42.33864974975586,-71.08653259277344,25.899999618530273,328114.21875,4689485.5,19,T
1644452918.2760024,[-----GPS DATA-----],42.338645935058594,-71.0865478515625,25.5,328112.8125,4689485.5,19,T
1644452919.27899,[-----GPS DATA-----],42.33863830566406,-71.08655548095703,25.399999618530273,328112.25,4689484.5,19,T
1644452920.3409307,[-----GPS DATA-----],42.33863067626953,-71.08656311035156,25.299999237060547,328111.53125,4689483.5,19,T
1644452921.278876,[-----GPS DATA-----],42.338626861572266,-71.08656311035156,25.200000762939453,328111.25,4689483.5,19,T
1644452922.2925372,[-----GPS DATA-----],42.33863067626953,-71.0865707397461,25.200000762939453,328110.84375,4689483.5,19,T
1644452923.278342,[-----GPS DATA-----],42.338626861572266,-71.0865707397461,25.200000762939453,328110.5625,4689483.5,19,T
1644452924.2781725,[-----GPS DATA-----],42.338623046875,-71.08657836914062,25.100000381469727,328110.15625,4689482.5,19,T
1644452925.3393693,[-----GPS DATA-----],42.338619232177734,-71.08657836914062,25.100000381469727,328109.875,4689482.5,19,T
1644452926.281934,[-----GPS DATA-----],42.338619232177734,-71.08658599853516,24.899999618530273,328109.71875,4689482.5,19,T
1644452927.294105,[-----GPS DATA-----],42.338619232177734,-71.08658599853516,24.799999237060547,328109.46875,4689482.5,19,T
1644452928.277993,[-----GPS DATA-----],42.338626861572266,-71.08658599853516,24.700000762939453,328109.34375,4689483.0,19,T
1644452929.2950609,[-----GPS DATA-----],42.3386344909668,-71.08659362792969,24.700000762939453,328109.09375,4689484.0,19,T
1644452930.356849,[-----GPS DATA-----],42.338645935058594,-71.08659362792969,24.700000762939453,328108.6875,4689485.5,19,T
1644452931.2805219,[-----GPS DATA-----],42.338645935058594,-71.08660125732422,24.700000762939453,328108.4375,4689485.5,19,T
1644452932.2827566,[-----GPS DATA-----],42.338645935058594,-71.08660125732422,24.600000381469727,328108.15625,4689485.5,19,T
1644452933.275909,[-----GPS DATA-----],42.33864212036133,-71.08660888671875,24.600000381469727,328107.875,4689485.0,19,T
1644452934.2765362,[-----GPS DATA-----],42.33863830566406,-71.08660888671875,24.5,328107.4375,4689484.5,19,T
1644452935.3389761,[-----GPS DATA-----],42.33863830566406,-71.08661651611328,24.5,328107.15625,4689484.5,19,T
1644452936.280489,[-----GPS DATA-----],42.33863067626953,-71.08661651611328,24.5,328106.75,4689484.0,19,T
1644452937.2783597,[-----GPS DATA-----],42.338626861572266,-71.08662414550781,24.5,328106.3125,4689483.5,19,T
1644452938.276011,[-----GPS DATA-----],42.338619232177734,-71.08663177490234,24.399999618530273,328105.875,4689482.5,19,T
1644452939.2763736,[-----GPS DATA-----],42.33860778808594,-71.08663177490234,24.399999618530273,328105.4375,4689481.5,19,T
1644452940.3382704,[-----GPS DATA-----],42.338600158691406,-71.08663940429688,24.299999237060547,328104.875,4689480.5,19,T
1644452941.280678,[-----GPS DATA-----],42.33858871459961,-71.0866470336914,24.299999237060547,328104.15625,4689479.5,19,T
1644452942.276428,[-----GPS DATA-----],42.33857727050781,-71.08665466308594,24.200000762939453,328103.5625,4689478.0,19,T
1644452943.2771726,[-----GPS DATA-----],42.33856201171875,-71.08666229248047,24.200000762939453,328102.96875,4689476.5,19,T
1644452944.2781649,[-----GPS DATA-----],42.33855056762695,-71.086669921875,24.100000381469727,328102.53125,4689475.0,19,T
1644452945.3403993,[-----GPS DATA-----],42.33854675292969,-71.086669921875,24.100000381469727,328102.125,4689474.5,19,T
1644452946.2662854,[-----GPS DATA-----],42.338539123535156,-71.08667755126953,24.100000381469727,328101.8125,4689474.0,19,T
1644452947.2767045,[-----GPS DATA-----],42.338531494140625,-71.08668518066406,24.0,328100.84375,4689473.0,19,T
1644452948.2761333,[-----GPS DATA-----],42.33852767944336,-71.08670043945312,23.899999618530273,328100.15625,4689472.5,19,T
1644452949.2762876,[-----GPS DATA-----],42.33852767944336,-71.08670043945312,23.899999618530273,328099.875,4689472.5,19,T
1644452950.338874,[-----GPS DATA-----],42.33852767944336,-71.08670806884766,23.799999237060547,328099.46875,4689472.5,19,T
1644452951.2765033,[-----GPS DATA-----],42.338523864746094,-71.08670806884766,23.700000762939453,328099.03125,4689472.0,19,T
1644452952.2768738,[-----GPS DATA-----],42.33851623535156,-71.08671569824219,23.5,328098.59375,4689471.5,19,T
1644452953.2780359,[-----GPS DATA-----],42.33850860595703,-71.08672332763672,23.299999237060547,328098.15625,4689470.5,19,T
1644452954.276339,[-----GPS DATA-----],42.338504791259766,-71.08672332763672,23.0,328097.75,4689470.0,19,T
1644452955.3386185,[-----GPS DATA-----],42.338497161865234,-71.08673095703125,22.299999237060547,328097.4375,4689469.0,19,T
1644452956.2765405,[-----GPS DATA-----],42.3384895324707,-71.08673095703125,22.100000381469727,328097.03125,4689468.5,19,T
1644452957.28108,[-----GPS DATA-----],42.33848571777344,-71.08673858642578,22.0,328096.46875,4689468.0,19,T
1644452958.2760084,[-----GPS DATA-----],42.33848190307617,-71.08674621582031,21.799999237060547,328096.03125,4689467.5,19,T
1644452959.2768996,[-----GPS DATA-----],42.33848571777344,-71.08674621582031,21.399999618530273,328095.78125,4689468.0,19,T
1644452960.3389475,[-----GPS DATA-----],42.33847427368164,-71.08675384521484,21.0,328095.34375,4689466.5,19,T
1644452961.278319,[-----GPS DATA-----],42.33846664428711,-71.08676147460938,20.200000762939453,328094.875,4689465.5,19,T
1644452962.276148,[-----GPS DATA-----],42.33845520019531,-71.08676147460938,19.700000762939453,328094.59375,4689464.5,19,T
1644452963.2762825,[-----GPS DATA-----],42.33845138549805,-71.0867691040039,19.200000762939453,328094.15625,4689464.0,19,T
1644452964.2773771,[-----GPS DATA-----],42.33844757080078,-71.0867691040039,18.5,328093.75,4689463.5,19,T
1644452965.3401022,[-----GPS DATA-----],42.338443756103516,-71.08677673339844,18.299999237060547,328093.46875,4689463.5,19,T
1644452966.278483,[-----GPS DATA-----],42.33844757080078,-71.08677673339844,18.100000381469727,328093.1875,4689464.0,19,T
1644452967.2923348,[-----GPS DATA-----],42.33845901489258,-71.08678436279297,18.100000381469727,328092.9375,4689465.0,19,T
1644452968.2747858,[-----GPS DATA-----],42.33846664428711,-71.08678436279297,18.200000762939453,328092.5625,4689466.0,19,T
1644452969.276752,[-----GPS DATA-----],42.33846664428711,-71.0867919921875,18.200000762939453,328092.28125,4689466.0,19,T
1644452970.3394132,[-----GPS DATA-----],42.33846664428711,-71.0867919921875,17.700000762939453,328092.0,4689465.5,19,T
1644452971.2785134,[-----GPS DATA-----],42.33845901489258,-71.08679962158203,16.899999618530273,328091.71875,4689465.0,19,T
1644452972.2751892,[-----GPS DATA-----],42.33845901489258,-71.08679962158203,17.299999237060547,328091.4375,4689465.0,19,T
1644452973.293743,[-----GPS DATA-----],42.33845901489258,-71.08679962158203,17.0,328091.15625,4689465.0,19,T
1644452974.2764165,[-----GPS DATA-----],42.33845520019531,-71.0868148803711,17.799999237060547,328090.46875,4689464.5,19,T
1644452975.3391829,[-----GPS DATA-----],42.338443756103516,-71.08682250976562,20.399999618530273,328089.46875,4689463.5,19,T
1644452976.280473,[-----GPS DATA-----],42.33843231201172,-71.08683776855469,23.0,328088.34375,4689462.0,19,T
1644452977.2781394,[-----GPS DATA-----],42.33842468261719,-71.08684539794922,25.100000381469727,328087.5,4689461.0,19,T
1644452978.2952151,[-----GPS DATA-----],42.33841323852539,-71.08685302734375,27.100000381469727,328086.9375,4689460.0,19,T
1644452979.2775571,[-----GPS DATA-----],42.338409423828125,-71.08686065673828,28.899999618530273,328086.21875,4689459.5,19,T
1644452980.340835,[-----GPS DATA-----],42.33839797973633,-71.08687591552734,31.200000762939453,328085.21875,4689458.5,19,T
1644452981.282696,[-----GPS DATA-----],42.33837127685547,-71.08688354492188,32.79999923706055,328084.46875,4689455.5,19,T
1644452982.2800045,[-----GPS DATA-----],42.338348388671875,-71.0868911743164,34.599998474121094,328083.875,4689453.0,19,T
1644452983.2795882,[-----GPS DATA-----],42.33833694458008,-71.08689880371094,36.20000076293945,328083.15625,4689451.5,19,T
1644452984.2800255,[-----GPS DATA-----],42.33832931518555,-71.08690643310547,38.20000076293945,328082.3125,4689451.0,19,T
1644452985.3429248,[-----GPS DATA-----],42.338321685791016,-71.0869140625,39.900001525878906,328081.59375,4689450.0,19,T
1644452986.2806847,[-----GPS DATA-----],42.338314056396484,-71.08692169189453,41.29999923706055,328080.875,4689449.5,19,T
1644452987.280138,[-----GPS DATA-----],42.33830642700195,-71.08692932128906,42.099998474121094,328080.4375,4689448.0,19,T
1644452988.2780719,[-----GPS DATA-----],42.338294982910156,-71.0869369506836,44.0,328079.875,4689447.0,19,T
1644452989.2836354,[-----GPS DATA-----],42.33829116821289,-71.0869369506836,45.0,328079.4375,4689446.5,19,T
1644452990.346188,[-----GPS DATA-----],42.33828353881836,-71.08695220947266,47.900001525878906,328078.34375,4689446.0,19,T
1644452991.2795289,[-----GPS DATA-----],42.338279724121094,-71.08695983886719,49.70000076293945,328077.625,4689445.5,19,T
1644452992.2792275,[-----GPS DATA-----],42.33827209472656,-71.08698272705078,52.79999923706055,328075.96875,4689444.5,19,T
1644452993.2797003,[-----GPS DATA-----],42.3382453918457,-71.08699798583984,54.29999923706055,328074.78125,4689441.5,19,T
1644452994.2801602,[-----GPS DATA-----],42.338226318359375,-71.08699798583984,55.20000076293945,328074.1875,4689439.5,19,T
1644452995.3433073,[-----GPS DATA-----],42.338218688964844,-71.08700561523438,55.900001525878906,328074.03125,4689439.0,19,T
1644452996.2790592,[-----GPS DATA-----],42.33821487426758,-71.08700561523438,56.20000076293945,328073.90625,4689438.5,19,T
1644452997.277836,[-----GPS DATA-----],42.33821105957031,-71.08700561523438,56.599998474121094,328073.875,4689438.0,19,T
1644452998.279543,[-----GPS DATA-----],42.33820343017578,-71.08700561523438,56.79999923706055,328073.71875,4689437.0,19,T
1644452999.2814457,[-----GPS DATA-----],42.33820343017578,-71.08700561523438,56.900001525878906,328073.71875,4689437.0,19,T
1644453000.3444104,[-----GPS DATA-----],42.338199615478516,-71.08700561523438,57.20000076293945,328073.96875,4689436.5,19,T
1644453001.2782264,[-----GPS DATA-----],42.33819580078125,-71.08699798583984,57.29999923706055,328074.125,4689436.5,19,T
1644453002.2784767,[-----GPS DATA-----],42.33819580078125,-71.08699798583984,57.29999923706055,328074.09375,4689436.0,19,T
1644453003.2790854,[-----GPS DATA-----],42.338191986083984,-71.08699798583984,57.099998474121094,328074.25,4689436.0,19,T
1644453004.281563,[-----GPS DATA-----],42.338191986083984,-71.08699798583984,57.29999923706055,328074.5,4689435.5,19,T
1644453005.343988,[-----GPS DATA-----],42.33818817138672,-71.08699035644531,57.400001525878906,328074.90625,4689435.5,19,T
1644453006.2807553,[-----GPS DATA-----],42.33818817138672,-71.08699035644531,57.29999923706055,328075.0625,4689435.5,19,T
1644453007.2794137,[-----GPS DATA-----],42.33818435668945,-71.08699035644531,57.400001525878906,328075.3125,4689435.0,19,T
1644453008.278658,[-----GPS DATA-----],42.33818817138672,-71.08698272705078,57.20000076293945,328075.59375,4689435.0,19,T
1644453009.2809868,[-----GPS DATA-----],42.33818817138672,-71.08698272705078,57.20000076293945,328075.875,4689435.5,19,T
1644453010.3435023,[-----GPS DATA-----],42.33818817138672,-71.08697509765625,57.5,328076.15625,4689435.5,19,T
1644453011.2779114,[-----GPS DATA-----],42.338191986083984,-71.08697509765625,57.70000076293945,328076.15625,4689435.5,19,T
1644453012.2786968,[-----GPS DATA-----],42.338191986083984,-71.08697509765625,57.70000076293945,328076.4375,4689435.5,19,T
1644453013.279778,[-----GPS DATA-----],42.338191986083984,-71.08697509765625,57.79999923706055,328076.5625,4689436.0,19,T
1644453014.280264,[-----GPS DATA-----],42.338191986083984,-71.08696746826172,57.900001525878906,328076.84375,4689435.5,19,T
1644453015.3405333,[-----GPS DATA-----],42.33818817138672,-71.08696746826172,57.900001525878906,328076.96875,4689435.5,19,T
1644453016.2793756,[-----GPS DATA-----],42.338191986083984,-71.08696746826172,58.0,328076.96875,4689435.5,19,T
1644453017.2775352,[-----GPS DATA-----],42.338191986083984,-71.08696746826172,58.0,328076.96875,4689435.5,19,T
1644453018.296443,[-----GPS DATA-----],42.338191986083984,-71.08696746826172,58.0,328076.96875,4689435.5,19,T
1644453019.2785962,[-----GPS DATA-----],42.338191986083984,-71.08696746826172,58.0,328076.96875,4689435.5,19,T
1644453020.3440075,[-----GPS DATA-----],42.338191986083984,-71.08696746826172,58.0,328076.96875,4689435.5,19,T
1644453021.2801151,[-----GPS DATA-----],42.338191986083984,-71.08696746826172,58.0,328076.96875,4689435.5,19,T
1644453022.2798905,[-----GPS DATA-----],42.338191986083984,-71.08696746826172,58.0,328076.96875,4689435.5,19,T
1644453023.2776003,[-----GPS DATA-----],42.338191986083984,-71.08696746826172,58.0,328076.96875,4689435.5,19,T
