[gd_scene load_steps=4 format=2]

[ext_resource path="res://Scripts/Map/PathNode/pathNode.gd" type="Script" id=1]
[ext_resource path="res://icon.png" type="Texture" id=2]

[sub_resource type="RectangleShape2D" id=1]
extents = Vector2( 5.00605, 5.03405 )

[node name="PathNode" type="Node2D"]
script = ExtResource( 1 )

[node name="Sprite" type="Sprite" parent="."]
modulate = Color( 1, 0, 0, 1 )
texture = ExtResource( 2 )
region_enabled = true
region_rect = Rect2( 16.859, 28.3252, 8.73883, 8.73883 )

[node name="WallChecker" type="Area2D" parent="."]
collision_layer = 32
collision_mask = 22

[node name="Hitbox" type="CollisionShape2D" parent="WallChecker"]
shape = SubResource( 1 )
[connection signal="body_entered" from="WallChecker" to="." method="_on_WallChecker_body_entered"]
