%
M48
M72
T01C0.01181
T02C0.04724
T03C0.05512
T04C0.11811
%
T01
X176197Y30828
X219504Y30828
X294307Y66261
X317929Y22954
X321866Y15080
X373047Y30828
X276591Y139095
X272654Y154843
X294307Y164686
X302181Y158780
X310055Y162717
X302181Y146969
X321866Y146969
X349425Y146969
X365173Y156812
X373047Y227678
X321866Y211930
X317929Y219804
X294307Y263111
X276591Y335946
X272654Y351694
X294307Y361536
X302181Y355631
X310055Y359568
X302181Y343820
X321866Y343820
X349425Y343820
X365173Y353662
X235252Y365473
X168323Y353662
X152575Y343820
X125016Y343820
X113205Y359568
X105331Y355631
X97457Y361536
X105331Y343820
X79740Y335946
X75803Y351694
X38402Y365473
X97457Y263111
X121079Y219804
X125016Y211930
X113205Y162717
X105331Y158780
X97457Y164686
X105331Y146969
X125016Y146969
X152575Y146969
X168323Y156812
X176197Y227678
X219504Y227678
X235252Y168623
X97457Y66261
X121079Y22954
X125016Y15080
X22654Y30828
X79740Y139095
X75803Y154843
X38402Y168623
X22654Y227678
T02
X26197Y54961
X26197Y88977
X26197Y112835
X26197Y146851
X26197Y251812
X26197Y285828
X26197Y309686
X26197Y343702
X223047Y343702
X223047Y309686
X223047Y285828
X223047Y251812
X223047Y146851
X223047Y112835
X223047Y88977
X223047Y54961
T03
X208480Y54961
X208480Y88977
X208480Y112835
X208480Y146851
X208480Y251812
X208480Y285828
X208480Y309686
X208480Y343702
X11630Y343702
X11630Y309686
X11630Y285828
X11630Y251812
X11630Y146851
X11630Y112835
X11630Y88977
X11630Y54961
T04
X184071Y15080
X211630Y15080
X211630Y184371
X184071Y184371
X184071Y211930
X211630Y211930
X211630Y381221
X184071Y381221
X14780Y381221
X14780Y211930
X14780Y184371
X14780Y15080
X380921Y15080
X380921Y184371
X380921Y211930
X380921Y381221
M30
