<?xml version="1.0" encoding="utf-8"?>
<!DOCTYPE eagle SYSTEM "eagle.dtd">
<eagle version="9.4.1">
<drawing>
<settings>
<setting alwaysvectorfont="no"/>
<setting verticaltext="up"/>
</settings>
<grid distance="0.1" unitdist="inch" unit="inch" style="lines" multiple="1" display="no" altdistance="0.01" altunitdist="inch" altunit="inch"/>
<layers>
<layer number="1" name="Top" color="4" fill="1" visible="no" active="no"/>
<layer number="2" name="Route2" color="1" fill="3" visible="no" active="no"/>
<layer number="3" name="Route3" color="4" fill="3" visible="no" active="no"/>
<layer number="4" name="Route4" color="1" fill="4" visible="no" active="no"/>
<layer number="5" name="Route5" color="4" fill="4" visible="no" active="no"/>
<layer number="6" name="Route6" color="1" fill="8" visible="no" active="no"/>
<layer number="7" name="Route7" color="4" fill="8" visible="no" active="no"/>
<layer number="8" name="Route8" color="1" fill="2" visible="no" active="no"/>
<layer number="9" name="Route9" color="4" fill="2" visible="no" active="no"/>
<layer number="10" name="Route10" color="1" fill="7" visible="no" active="no"/>
<layer number="11" name="Route11" color="4" fill="7" visible="no" active="no"/>
<layer number="12" name="Route12" color="1" fill="5" visible="no" active="no"/>
<layer number="13" name="Route13" color="4" fill="5" visible="no" active="no"/>
<layer number="14" name="Route14" color="1" fill="6" visible="no" active="no"/>
<layer number="15" name="Route15" color="4" fill="6" visible="no" active="no"/>
<layer number="16" name="Bottom" color="1" fill="1" visible="no" active="no"/>
<layer number="17" name="Pads" color="2" fill="1" visible="no" active="no"/>
<layer number="18" name="Vias" color="2" fill="1" visible="no" active="no"/>
<layer number="19" name="Unrouted" color="6" fill="1" visible="no" active="no"/>
<layer number="20" name="Dimension" color="15" fill="1" visible="no" active="no"/>
<layer number="21" name="tPlace" color="7" fill="1" visible="no" active="no"/>
<layer number="22" name="bPlace" color="7" fill="1" visible="no" active="no"/>
<layer number="23" name="tOrigins" color="15" fill="1" visible="no" active="no"/>
<layer number="24" name="bOrigins" color="15" fill="1" visible="no" active="no"/>
<layer number="25" name="tNames" color="7" fill="1" visible="no" active="no"/>
<layer number="26" name="bNames" color="7" fill="1" visible="no" active="no"/>
<layer number="27" name="tValues" color="7" fill="1" visible="no" active="no"/>
<layer number="28" name="bValues" color="7" fill="1" visible="no" active="no"/>
<layer number="29" name="tStop" color="7" fill="3" visible="no" active="no"/>
<layer number="30" name="bStop" color="7" fill="6" visible="no" active="no"/>
<layer number="31" name="tCream" color="7" fill="4" visible="no" active="no"/>
<layer number="32" name="bCream" color="7" fill="5" visible="no" active="no"/>
<layer number="33" name="tFinish" color="6" fill="3" visible="no" active="no"/>
<layer number="34" name="bFinish" color="6" fill="6" visible="no" active="no"/>
<layer number="35" name="tGlue" color="7" fill="4" visible="no" active="no"/>
<layer number="36" name="bGlue" color="7" fill="5" visible="no" active="no"/>
<layer number="37" name="tTest" color="7" fill="1" visible="no" active="no"/>
<layer number="38" name="bTest" color="7" fill="1" visible="no" active="no"/>
<layer number="39" name="tKeepout" color="4" fill="11" visible="no" active="no"/>
<layer number="40" name="bKeepout" color="1" fill="11" visible="no" active="no"/>
<layer number="41" name="tRestrict" color="4" fill="10" visible="no" active="no"/>
<layer number="42" name="bRestrict" color="1" fill="10" visible="no" active="no"/>
<layer number="43" name="vRestrict" color="2" fill="10" visible="no" active="no"/>
<layer number="44" name="Drills" color="7" fill="1" visible="no" active="no"/>
<layer number="45" name="Holes" color="7" fill="1" visible="no" active="no"/>
<layer number="46" name="Milling" color="3" fill="1" visible="no" active="no"/>
<layer number="47" name="Measures" color="7" fill="1" visible="no" active="no"/>
<layer number="48" name="Document" color="7" fill="1" visible="no" active="no"/>
<layer number="49" name="Reference" color="7" fill="1" visible="no" active="no"/>
<layer number="51" name="tDocu" color="7" fill="1" visible="no" active="no"/>
<layer number="52" name="bDocu" color="7" fill="1" visible="no" active="no"/>
<layer number="88" name="SimResults" color="9" fill="1" visible="yes" active="yes"/>
<layer number="89" name="SimProbes" color="9" fill="1" visible="yes" active="yes"/>
<layer number="90" name="Modules" color="5" fill="1" visible="yes" active="yes"/>
<layer number="91" name="Nets" color="2" fill="1" visible="yes" active="yes"/>
<layer number="92" name="Busses" color="1" fill="1" visible="yes" active="yes"/>
<layer number="93" name="Pins" color="2" fill="1" visible="no" active="yes"/>
<layer number="94" name="Symbols" color="4" fill="1" visible="yes" active="yes"/>
<layer number="95" name="Names" color="7" fill="1" visible="yes" active="yes"/>
<layer number="96" name="Values" color="7" fill="1" visible="yes" active="yes"/>
<layer number="97" name="Info" color="7" fill="1" visible="yes" active="yes"/>
<layer number="98" name="Guide" color="6" fill="1" visible="yes" active="yes"/>
</layers>
<schematic xreflabel="%F%N/%S.%C%R" xrefpart="/%S.%C%R">
<libraries>
<library name="testpad" urn="urn:adsk.eagle:library:385">
<description>&lt;b&gt;Test Pins/Pads&lt;/b&gt;&lt;p&gt;
Cream on SMD OFF.&lt;br&gt;
new: Attribute TP_SIGNAL_NAME&lt;br&gt;
&lt;author&gt;Created by librarian@cadsoft.de&lt;/author&gt;</description>
<packages>
<package name="B1,27" urn="urn:adsk.eagle:footprint:27900/1" library_version="2">
<description>&lt;b&gt;TEST PAD&lt;/b&gt;</description>
<wire x1="-0.635" y1="0" x2="0.635" y2="0" width="0.0024" layer="37"/>
<wire x1="0" y1="0.635" x2="0" y2="-0.635" width="0.0024" layer="37"/>
<smd name="TP" x="0" y="0" dx="1.27" dy="1.27" layer="1" roundness="100" cream="no"/>
<text x="-0.635" y="1.016" size="1.27" layer="25" ratio="10">&gt;NAME</text>
<text x="-0.635" y="-0.762" size="0.0254" layer="27">&gt;VALUE</text>
<text x="-0.635" y="-1.905" size="1" layer="37">&gt;TP_SIGNAL_NAME</text>
</package>
<package name="B2,54" urn="urn:adsk.eagle:footprint:27901/1" library_version="2">
<description>&lt;b&gt;TEST PAD&lt;/b&gt;</description>
<wire x1="-0.635" y1="0" x2="0.635" y2="0" width="0.0024" layer="37"/>
<wire x1="0" y1="-0.635" x2="0" y2="0.635" width="0.0024" layer="37"/>
<circle x="0" y="0" radius="0.635" width="0.254" layer="37"/>
<smd name="TP" x="0" y="0" dx="2.54" dy="2.54" layer="1" roundness="100" cream="no"/>
<text x="-1.27" y="1.651" size="1.27" layer="25" ratio="10">&gt;NAME</text>
<text x="-1.27" y="-1.397" size="0.0254" layer="27">&gt;VALUE</text>
<text x="-1.27" y="-3.175" size="1" layer="37">&gt;TP_SIGNAL_NAME</text>
</package>
<package name="P1-13" urn="urn:adsk.eagle:footprint:27902/1" library_version="2">
<description>&lt;b&gt;TEST PAD&lt;/b&gt;</description>
<circle x="0" y="0" radius="0.762" width="0.1524" layer="51"/>
<pad name="TP" x="0" y="0" drill="1.3208" diameter="2.159" shape="octagon"/>
<text x="-1.016" y="1.27" size="1.27" layer="25" ratio="10">&gt;NAME</text>
<text x="0" y="0" size="0.0254" layer="27">&gt;VALUE</text>
<text x="-1.27" y="-2.54" size="1" layer="37">&gt;TP_SIGNAL_NAME</text>
<rectangle x1="-0.3302" y1="-0.3302" x2="0.3302" y2="0.3302" layer="51"/>
</package>
<package name="P1-13Y" urn="urn:adsk.eagle:footprint:27903/1" library_version="2">
<description>&lt;b&gt;TEST PAD&lt;/b&gt;</description>
<circle x="0" y="0" radius="0.762" width="0.1524" layer="51"/>
<pad name="TP" x="0" y="0" drill="1.3208" diameter="1.905" shape="long" rot="R90"/>
<text x="-0.889" y="2.159" size="1.27" layer="25" ratio="10">&gt;NAME</text>
<text x="0" y="0" size="0.0254" layer="27">&gt;VALUE</text>
<text x="-1.27" y="-3.81" size="1" layer="37">&gt;TP_SIGNAL_NAME</text>
<rectangle x1="-0.3302" y1="-0.3302" x2="0.3302" y2="0.3302" layer="51"/>
</package>
<package name="P1-17" urn="urn:adsk.eagle:footprint:27904/1" library_version="2">
<description>&lt;b&gt;TEST PAD&lt;/b&gt;</description>
<circle x="0" y="0" radius="0.8128" width="0.1524" layer="51"/>
<pad name="TP" x="0" y="0" drill="1.7018" diameter="2.54" shape="octagon"/>
<text x="-1.143" y="1.397" size="1.27" layer="25" ratio="10">&gt;NAME</text>
<text x="0" y="0" size="0.0254" layer="27">&gt;VALUE</text>
<text x="-1.27" y="-3.175" size="1" layer="37">&gt;TP_SIGNAL_NAME</text>
<rectangle x1="-0.3302" y1="-0.3302" x2="0.3302" y2="0.3302" layer="51"/>
</package>
<package name="P1-17Y" urn="urn:adsk.eagle:footprint:27905/1" library_version="2">
<description>&lt;b&gt;TEST PAD&lt;/b&gt;</description>
<circle x="0" y="0" radius="0.8128" width="0.1524" layer="51"/>
<pad name="TP" x="0" y="0" drill="1.7018" diameter="2.1208" shape="long" rot="R90"/>
<text x="-1.143" y="2.286" size="1.27" layer="25" ratio="10">&gt;NAME</text>
<text x="0" y="0" size="0.0254" layer="27">&gt;VALUE</text>
<text x="-1.27" y="-3.81" size="1" layer="37">&gt;TP_SIGNAL_NAME</text>
<rectangle x1="-0.3302" y1="-0.3302" x2="0.3302" y2="0.3302" layer="51"/>
</package>
<package name="P1-20" urn="urn:adsk.eagle:footprint:27906/1" library_version="2">
<description>&lt;b&gt;TEST PAD&lt;/b&gt;</description>
<circle x="0" y="0" radius="1.016" width="0.1524" layer="51"/>
<pad name="TP" x="0" y="0" drill="2.0066" diameter="3.1496" shape="octagon"/>
<text x="-1.524" y="1.778" size="1.27" layer="25" ratio="10">&gt;NAME</text>
<text x="0" y="0" size="0.0254" layer="27">&gt;VALUE</text>
<text x="-1.27" y="-3.175" size="1" layer="37">&gt;TP_SIGNAL_NAME</text>
<rectangle x1="-0.3302" y1="-0.3302" x2="0.3302" y2="0.3302" layer="51"/>
</package>
<package name="P1-20Y" urn="urn:adsk.eagle:footprint:27907/1" library_version="2">
<description>&lt;b&gt;TEST PAD&lt;/b&gt;</description>
<circle x="0" y="0" radius="1.016" width="0.1524" layer="51"/>
<pad name="TP" x="0" y="0" drill="2.0066" diameter="2.54" shape="long" rot="R90"/>
<text x="-1.27" y="2.794" size="1.27" layer="25" ratio="10">&gt;NAME</text>
<text x="0" y="0" size="0.0254" layer="27">&gt;VALUE</text>
<text x="-1.27" y="-4.445" size="1" layer="37">&gt;TP_SIGNAL_NAME</text>
<rectangle x1="-0.3302" y1="-0.3302" x2="0.3302" y2="0.3302" layer="51"/>
</package>
<package name="TP06R" urn="urn:adsk.eagle:footprint:27908/1" library_version="2">
<description>&lt;b&gt;TEST PAD&lt;/b&gt;</description>
<smd name="TP" x="0" y="0" dx="0.6" dy="0.6" layer="1" roundness="100" cream="no"/>
<text x="-0.3" y="0.4001" size="1.27" layer="25">&gt;NAME</text>
<text x="-0.254" y="-0.381" size="0.0254" layer="27">&gt;VALUE</text>
<text x="0" y="-1.905" size="1" layer="37">&gt;TP_SIGNAL_NAME</text>
</package>
<package name="TP06SQ" urn="urn:adsk.eagle:footprint:27909/1" library_version="2">
<description>&lt;b&gt;TEST PAD&lt;/b&gt;</description>
<smd name="TP" x="0" y="0" dx="0.5996" dy="0.5996" layer="1" cream="no"/>
<text x="-0.3" y="0.4001" size="1.27" layer="25">&gt;NAME</text>
<text x="-0.254" y="-0.381" size="0.0254" layer="27">&gt;VALUE</text>
<text x="0" y="-1.905" size="1" layer="37">&gt;TP_SIGNAL_NAME</text>
</package>
<package name="TP07R" urn="urn:adsk.eagle:footprint:27910/1" library_version="2">
<description>&lt;b&gt;TEST PAD&lt;/b&gt;</description>
<smd name="TP" x="0" y="0" dx="0.7" dy="0.7" layer="1" roundness="100" cream="no"/>
<text x="-0.3" y="0.4001" size="1.27" layer="25">&gt;NAME</text>
<text x="-0.254" y="-0.508" size="0.0254" layer="27">&gt;VALUE</text>
<text x="0" y="-1.905" size="1" layer="37">&gt;TP_SIGNAL_NAME</text>
</package>
<package name="TP07SQ" urn="urn:adsk.eagle:footprint:27911/1" library_version="2">
<description>&lt;b&gt;TEST PAD&lt;/b&gt;</description>
<smd name="TP" x="0" y="0" dx="0.7" dy="0.7" layer="1" cream="no"/>
<text x="-0.3" y="0.4001" size="1.27" layer="25">&gt;NAME</text>
<text x="-0.381" y="-0.381" size="0.0254" layer="27">&gt;VALUE</text>
<text x="0" y="-1.905" size="1" layer="37">&gt;TP_SIGNAL_NAME</text>
</package>
<package name="TP08R" urn="urn:adsk.eagle:footprint:27912/1" library_version="2">
<description>&lt;b&gt;TEST PAD&lt;/b&gt;</description>
<smd name="TP" x="0" y="0" dx="0.8" dy="0.8" layer="1" roundness="100" cream="no"/>
<text x="-0.3" y="0.4001" size="1.27" layer="25">&gt;NAME</text>
<text x="-0.381" y="-0.381" size="0.0254" layer="27">&gt;VALUE</text>
<text x="0" y="-1.905" size="1" layer="37">&gt;TP_SIGNAL_NAME</text>
</package>
<package name="TP08SQ" urn="urn:adsk.eagle:footprint:27913/1" library_version="2">
<description>&lt;b&gt;TEST PAD&lt;/b&gt;</description>
<smd name="TP" x="0" y="0" dx="0.8" dy="0.8" layer="1" cream="no"/>
<text x="-0.3" y="0.4001" size="1.27" layer="25">&gt;NAME</text>
<text x="-0.381" y="-0.508" size="0.0254" layer="27">&gt;VALUE</text>
<text x="0" y="-1.905" size="1" layer="37">&gt;TP_SIGNAL_NAME</text>
</package>
<package name="TP09R" urn="urn:adsk.eagle:footprint:27914/1" library_version="2">
<description>&lt;b&gt;TEST PAD&lt;/b&gt;</description>
<smd name="TP" x="0" y="0" dx="0.9" dy="0.9" layer="1" roundness="100" cream="no"/>
<text x="-0.4501" y="0.5001" size="1.27" layer="25">&gt;NAME</text>
<text x="-0.381" y="-0.508" size="0.0254" layer="27">&gt;VALUE</text>
<text x="0" y="-1.905" size="1" layer="37">&gt;TP_SIGNAL_NAME</text>
</package>
<package name="TP09SQ" urn="urn:adsk.eagle:footprint:27915/1" library_version="2">
<description>&lt;b&gt;TEST PAD&lt;/b&gt;</description>
<smd name="TP" x="0" y="0" dx="0.8998" dy="0.8998" layer="1" cream="no"/>
<text x="-0.4501" y="0.5001" size="1.27" layer="25">&gt;NAME</text>
<text x="-0.381" y="-0.508" size="0.0254" layer="27">&gt;VALUE</text>
<text x="0" y="-1.905" size="1" layer="37">&gt;TP_SIGNAL_NAME</text>
</package>
<package name="TP10R" urn="urn:adsk.eagle:footprint:27916/1" library_version="2">
<description>&lt;b&gt;TEST PAD&lt;/b&gt;</description>
<smd name="TP" x="0" y="0" dx="1" dy="1" layer="1" roundness="100" cream="no"/>
<text x="-0.5001" y="0.5499" size="1.27" layer="25">&gt;NAME</text>
<text x="-0.381" y="-0.508" size="0.0254" layer="27">&gt;VALUE</text>
<text x="0" y="-1.905" size="1" layer="37">&gt;TP_SIGNAL_NAME</text>
</package>
<package name="TP10SQ" urn="urn:adsk.eagle:footprint:27917/1" library_version="2">
<description>&lt;b&gt;TEST PAD&lt;/b&gt;</description>
<smd name="TP" x="0" y="0" dx="1" dy="1" layer="1" cream="no"/>
<text x="-0.5001" y="0.5499" size="1.27" layer="25">&gt;NAME</text>
<text x="-0.508" y="-0.635" size="0.0254" layer="27">&gt;VALUE</text>
<text x="0" y="-1.905" size="1" layer="37">&gt;TP_SIGNAL_NAME</text>
</package>
<package name="TP11R" urn="urn:adsk.eagle:footprint:27918/1" library_version="2">
<description>&lt;b&gt;TEST PAD&lt;/b&gt;</description>
<smd name="TP" x="0" y="0" dx="1.1" dy="1.1" layer="1" roundness="100" cream="no"/>
<text x="-0.5499" y="0.5999" size="1.27" layer="25">&gt;NAME</text>
<text x="-0.508" y="-0.508" size="0.0254" layer="27">&gt;VALUE</text>
<text x="0" y="-1.905" size="1" layer="37">&gt;TP_SIGNAL_NAME</text>
</package>
<package name="TP11SQ" urn="urn:adsk.eagle:footprint:27919/1" library_version="2">
<description>&lt;b&gt;TEST PAD&lt;/b&gt;</description>
<smd name="TP" x="0" y="0" dx="1.1" dy="1.1" layer="1" cream="no"/>
<text x="-0.5499" y="0.5999" size="1.27" layer="25">&gt;NAME</text>
<text x="-0.508" y="-0.635" size="0.0254" layer="27">&gt;VALUE</text>
<text x="0" y="-2.54" size="1" layer="37">&gt;TP_SIGNAL_NAME</text>
</package>
<package name="TP12SQ" urn="urn:adsk.eagle:footprint:27920/1" library_version="2">
<description>&lt;b&gt;TEST PAD&lt;/b&gt;</description>
<smd name="TP" x="0" y="0" dx="1.1998" dy="1.1998" layer="1" cream="no"/>
<text x="-0.5999" y="0.65" size="1.27" layer="25">&gt;NAME</text>
<text x="-0.508" y="-0.635" size="0.0254" layer="27">&gt;VALUE</text>
<text x="0" y="-2.54" size="1" layer="37">&gt;TP_SIGNAL_NAME</text>
</package>
<package name="TP12R" urn="urn:adsk.eagle:footprint:27921/1" library_version="2">
<description>&lt;b&gt;TEST PAD&lt;/b&gt;</description>
<smd name="TP" x="0" y="0" dx="1.2" dy="1.2" layer="1" roundness="100" cream="no"/>
<text x="-0.5999" y="0.65" size="1.27" layer="25">&gt;NAME</text>
<text x="-0.508" y="-0.635" size="0.0254" layer="27">&gt;VALUE</text>
<text x="0" y="-2.54" size="1" layer="37">&gt;TP_SIGNAL_NAME</text>
</package>
<package name="TP13R" urn="urn:adsk.eagle:footprint:27922/1" library_version="2">
<description>&lt;b&gt;TEST PAD&lt;/b&gt;</description>
<smd name="TP" x="0" y="0" dx="1.3" dy="1.3" layer="1" roundness="100" cream="no"/>
<text x="-0.65" y="0.7" size="1.27" layer="25">&gt;NAME</text>
<text x="-0.508" y="-0.635" size="0.0254" layer="27">&gt;VALUE</text>
<text x="0" y="-2.54" size="1" layer="37">&gt;TP_SIGNAL_NAME</text>
</package>
<package name="TP14R" urn="urn:adsk.eagle:footprint:27923/1" library_version="2">
<description>&lt;b&gt;TEST PAD&lt;/b&gt;</description>
<smd name="TP" x="0" y="0" dx="1.4" dy="1.4" layer="1" roundness="100" cream="no"/>
<text x="-0.7" y="0.7501" size="1.27" layer="25">&gt;NAME</text>
<text x="-0.508" y="-0.762" size="0.0254" layer="27">&gt;VALUE</text>
<text x="0" y="-2.54" size="1" layer="37">&gt;TP_SIGNAL_NAME</text>
</package>
<package name="TP15R" urn="urn:adsk.eagle:footprint:27924/1" library_version="2">
<description>&lt;b&gt;TEST PAD&lt;/b&gt;</description>
<smd name="TP" x="0" y="0" dx="1.5" dy="1.5" layer="1" roundness="100" cream="no"/>
<text x="-0.7501" y="0.8001" size="1.27" layer="25">&gt;NAME</text>
<text x="-0.635" y="-0.762" size="0.0254" layer="27">&gt;VALUE</text>
<text x="0" y="-2.54" size="1" layer="37">&gt;TP_SIGNAL_NAME</text>
</package>
<package name="TP16R" urn="urn:adsk.eagle:footprint:27925/1" library_version="2">
<description>&lt;b&gt;TEST PAD&lt;/b&gt;</description>
<smd name="TP" x="0" y="0" dx="1.6" dy="1.6" layer="1" roundness="100" cream="no"/>
<text x="-0.8001" y="0.8499" size="1.27" layer="25">&gt;NAME</text>
<text x="-0.635" y="-0.762" size="0.0254" layer="27">&gt;VALUE</text>
<text x="0" y="-2.54" size="1" layer="37">&gt;TP_SIGNAL_NAME</text>
</package>
<package name="TP17R" urn="urn:adsk.eagle:footprint:27926/1" library_version="2">
<description>&lt;b&gt;TEST PAD&lt;/b&gt;</description>
<smd name="TP" x="0" y="0" dx="1.7" dy="1.7" layer="1" roundness="100" cream="no"/>
<text x="-0.8499" y="0.8999" size="1.27" layer="25">&gt;NAME</text>
<text x="-0.635" y="-0.889" size="0.0254" layer="27">&gt;VALUE</text>
<text x="0" y="-2.54" size="1" layer="37">&gt;TP_SIGNAL_NAME</text>
</package>
<package name="TP18R" urn="urn:adsk.eagle:footprint:27927/1" library_version="2">
<description>&lt;b&gt;TEST PAD&lt;/b&gt;</description>
<smd name="TP" x="0" y="0" dx="1.8" dy="1.8" layer="1" roundness="100" cream="no"/>
<text x="-0.8999" y="0.95" size="1.27" layer="25">&gt;NAME</text>
<text x="-0.762" y="-0.889" size="0.0254" layer="27">&gt;VALUE</text>
<text x="0" y="-2.54" size="1" layer="37">&gt;TP_SIGNAL_NAME</text>
</package>
<package name="TP19R" urn="urn:adsk.eagle:footprint:27928/1" library_version="2">
<description>&lt;b&gt;TEST PAD&lt;/b&gt;</description>
<smd name="TP" x="0" y="0" dx="1.9" dy="1.9" layer="1" roundness="100" cream="no"/>
<text x="-0.95" y="1" size="1.27" layer="25">&gt;NAME</text>
<text x="-0.762" y="-0.889" size="0.0254" layer="27">&gt;VALUE</text>
<text x="0" y="-2.54" size="1" layer="37">&gt;TP_SIGNAL_NAME</text>
</package>
<package name="TP20R" urn="urn:adsk.eagle:footprint:27929/1" library_version="2">
<description>&lt;b&gt;TEST PAD&lt;/b&gt;</description>
<smd name="TP" x="0" y="0" dx="2" dy="2" layer="1" roundness="100" cream="no"/>
<text x="-1" y="1.05" size="1.27" layer="25">&gt;NAME</text>
<text x="-0.762" y="-1.016" size="0.0254" layer="27">&gt;VALUE</text>
<text x="0" y="-2.54" size="1" layer="37">&gt;TP_SIGNAL_NAME</text>
</package>
<package name="TP13SQ" urn="urn:adsk.eagle:footprint:27930/1" library_version="2">
<description>&lt;b&gt;TEST PAD&lt;/b&gt;</description>
<smd name="TP" x="0" y="0" dx="1.3" dy="1.3" layer="1" cream="no"/>
<text x="-0.65" y="0.7" size="1.27" layer="25">&gt;NAME</text>
<text x="-0.635" y="-0.762" size="0.0254" layer="27">&gt;VALUE</text>
<text x="0" y="-2.54" size="1" layer="37">&gt;TP_SIGNAL_NAME</text>
</package>
<package name="TP14SQ" urn="urn:adsk.eagle:footprint:27931/1" library_version="2">
<description>&lt;b&gt;TEST PAD&lt;/b&gt;</description>
<smd name="TP" x="0" y="0" dx="1.4" dy="1.4" layer="1" cream="no"/>
<text x="-0.7" y="0.7501" size="1.27" layer="25">&gt;NAME</text>
<text x="-0.635" y="-0.762" size="0.0254" layer="27">&gt;VALUE</text>
<text x="0" y="-2.54" size="1" layer="37">&gt;TP_SIGNAL_NAME</text>
</package>
<package name="TP15SQ" urn="urn:adsk.eagle:footprint:27932/1" library_version="2">
<description>&lt;b&gt;TEST PAD&lt;/b&gt;</description>
<smd name="TP" x="0" y="0" dx="1.5" dy="1.5" layer="1" cream="no"/>
<text x="-0.7501" y="0.8001" size="1.27" layer="25">&gt;NAME</text>
<text x="-0.762" y="-0.889" size="0.0254" layer="27">&gt;VALUE</text>
<text x="0" y="-2.54" size="1" layer="37">&gt;TP_SIGNAL_NAME</text>
</package>
<package name="TP16SQ" urn="urn:adsk.eagle:footprint:27933/1" library_version="2">
<description>&lt;b&gt;TEST PAD&lt;/b&gt;</description>
<smd name="TP" x="0" y="0" dx="1.5996" dy="1.5996" layer="1" cream="no"/>
<text x="-0.8001" y="0.8499" size="1.27" layer="25">&gt;NAME</text>
<text x="-0.762" y="-0.889" size="0.0254" layer="27">&gt;VALUE</text>
<text x="0" y="-2.54" size="1" layer="37">&gt;TP_SIGNAL_NAME</text>
</package>
<package name="TP17SQ" urn="urn:adsk.eagle:footprint:27934/1" library_version="2">
<description>&lt;b&gt;TEST PAD&lt;/b&gt;</description>
<smd name="TP" x="0" y="0" dx="1.7" dy="1.7" layer="1" cream="no"/>
<text x="-0.8499" y="0.8999" size="1.27" layer="25">&gt;NAME</text>
<text x="-0.762" y="-0.889" size="0.0254" layer="27">&gt;VALUE</text>
<text x="0" y="-2.54" size="1" layer="37">&gt;TP_SIGNAL_NAME</text>
</package>
<package name="TP18SQ" urn="urn:adsk.eagle:footprint:27935/1" library_version="2">
<description>&lt;b&gt;TEST PAD&lt;/b&gt;</description>
<smd name="TP" x="0" y="0" dx="1.8" dy="1.8" layer="1" cream="no"/>
<text x="-0.8999" y="0.95" size="1.27" layer="25">&gt;NAME</text>
<text x="-0.889" y="-1.016" size="0.0254" layer="27">&gt;VALUE</text>
<text x="0" y="-2.54" size="1" layer="37">&gt;TP_SIGNAL_NAME</text>
</package>
<package name="TP19SQ" urn="urn:adsk.eagle:footprint:27936/1" library_version="2">
<description>&lt;b&gt;TEST PAD&lt;/b&gt;</description>
<smd name="TP" x="0" y="0" dx="1.8998" dy="1.8998" layer="1" cream="no"/>
<text x="-0.95" y="1" size="1.27" layer="25">&gt;NAME</text>
<text x="-0.889" y="-1.016" size="0.0254" layer="27">&gt;VALUE</text>
<text x="0" y="-2.54" size="1" layer="37">&gt;TP_SIGNAL_NAME</text>
</package>
<package name="TP20SQ" urn="urn:adsk.eagle:footprint:27937/1" library_version="2">
<description>&lt;b&gt;TEST PAD&lt;/b&gt;</description>
<smd name="TP" x="0" y="0" dx="2" dy="2" layer="1" cream="no"/>
<text x="-1" y="1.05" size="1.27" layer="25">&gt;NAME</text>
<text x="-1.016" y="-1.143" size="0.0254" layer="27">&gt;VALUE</text>
<text x="0" y="-2.54" size="1" layer="37">&gt;TP_SIGNAL_NAME</text>
</package>
</packages>
<packages3d>
<package3d name="B1,27" urn="urn:adsk.eagle:package:27944/2" type="box" library_version="2">
<description>TEST PAD</description>
<packageinstances>
<packageinstance name="B1,27"/>
</packageinstances>
</package3d>
<package3d name="B2,54" urn="urn:adsk.eagle:package:27948/1" type="box" library_version="2">
<description>TEST PAD</description>
<packageinstances>
<packageinstance name="B2,54"/>
</packageinstances>
</package3d>
<package3d name="P1-13" urn="urn:adsk.eagle:package:27946/1" type="box" library_version="2">
<description>TEST PAD</description>
<packageinstances>
<packageinstance name="P1-13"/>
</packageinstances>
</package3d>
<package3d name="P1-13Y" urn="urn:adsk.eagle:package:27947/1" type="box" library_version="2">
<description>TEST PAD</description>
<packageinstances>
<packageinstance name="P1-13Y"/>
</packageinstances>
</package3d>
<package3d name="P1-17" urn="urn:adsk.eagle:package:27949/1" type="box" library_version="2">
<description>TEST PAD</description>
<packageinstances>
<packageinstance name="P1-17"/>
</packageinstances>
</package3d>
<package3d name="P1-17Y" urn="urn:adsk.eagle:package:27953/1" type="box" library_version="2">
<description>TEST PAD</description>
<packageinstances>
<packageinstance name="P1-17Y"/>
</packageinstances>
</package3d>
<package3d name="P1-20" urn="urn:adsk.eagle:package:27950/1" type="box" library_version="2">
<description>TEST PAD</description>
<packageinstances>
<packageinstance name="P1-20"/>
</packageinstances>
</package3d>
<package3d name="P1-20Y" urn="urn:adsk.eagle:package:27951/1" type="box" library_version="2">
<description>TEST PAD</description>
<packageinstances>
<packageinstance name="P1-20Y"/>
</packageinstances>
</package3d>
<package3d name="TP06R" urn="urn:adsk.eagle:package:27954/1" type="box" library_version="2">
<description>TEST PAD</description>
<packageinstances>
<packageinstance name="TP06R"/>
</packageinstances>
</package3d>
<package3d name="TP06SQ" urn="urn:adsk.eagle:package:27952/1" type="box" library_version="2">
<description>TEST PAD</description>
<packageinstances>
<packageinstance name="TP06SQ"/>
</packageinstances>
</package3d>
<package3d name="TP07R" urn="urn:adsk.eagle:package:27970/1" type="box" library_version="2">
<description>TEST PAD</description>
<packageinstances>
<packageinstance name="TP07R"/>
</packageinstances>
</package3d>
<package3d name="TP07SQ" urn="urn:adsk.eagle:package:27955/1" type="box" library_version="2">
<description>TEST PAD</description>
<packageinstances>
<packageinstance name="TP07SQ"/>
</packageinstances>
</package3d>
<package3d name="TP08R" urn="urn:adsk.eagle:package:27956/1" type="box" library_version="2">
<description>TEST PAD</description>
<packageinstances>
<packageinstance name="TP08R"/>
</packageinstances>
</package3d>
<package3d name="TP08SQ" urn="urn:adsk.eagle:package:27960/1" type="box" library_version="2">
<description>TEST PAD</description>
<packageinstances>
<packageinstance name="TP08SQ"/>
</packageinstances>
</package3d>
<package3d name="TP09R" urn="urn:adsk.eagle:package:27958/1" type="box" library_version="2">
<description>TEST PAD</description>
<packageinstances>
<packageinstance name="TP09R"/>
</packageinstances>
</package3d>
<package3d name="TP09SQ" urn="urn:adsk.eagle:package:27957/1" type="box" library_version="2">
<description>TEST PAD</description>
<packageinstances>
<packageinstance name="TP09SQ"/>
</packageinstances>
</package3d>
<package3d name="TP10R" urn="urn:adsk.eagle:package:27959/1" type="box" library_version="2">
<description>TEST PAD</description>
<packageinstances>
<packageinstance name="TP10R"/>
</packageinstances>
</package3d>
<package3d name="TP10SQ" urn="urn:adsk.eagle:package:27962/1" type="box" library_version="2">
<description>TEST PAD</description>
<packageinstances>
<packageinstance name="TP10SQ"/>
</packageinstances>
</package3d>
<package3d name="TP11R" urn="urn:adsk.eagle:package:27961/1" type="box" library_version="2">
<description>TEST PAD</description>
<packageinstances>
<packageinstance name="TP11R"/>
</packageinstances>
</package3d>
<package3d name="TP11SQ" urn="urn:adsk.eagle:package:27965/1" type="box" library_version="2">
<description>TEST PAD</description>
<packageinstances>
<packageinstance name="TP11SQ"/>
</packageinstances>
</package3d>
<package3d name="TP12SQ" urn="urn:adsk.eagle:package:27964/1" type="box" library_version="2">
<description>TEST PAD</description>
<packageinstances>
<packageinstance name="TP12SQ"/>
</packageinstances>
</package3d>
<package3d name="TP12R" urn="urn:adsk.eagle:package:27963/1" type="box" library_version="2">
<description>TEST PAD</description>
<packageinstances>
<packageinstance name="TP12R"/>
</packageinstances>
</package3d>
<package3d name="TP13R" urn="urn:adsk.eagle:package:27967/1" type="box" library_version="2">
<description>TEST PAD</description>
<packageinstances>
<packageinstance name="TP13R"/>
</packageinstances>
</package3d>
<package3d name="TP14R" urn="urn:adsk.eagle:package:27966/1" type="box" library_version="2">
<description>TEST PAD</description>
<packageinstances>
<packageinstance name="TP14R"/>
</packageinstances>
</package3d>
<package3d name="TP15R" urn="urn:adsk.eagle:package:27968/1" type="box" library_version="2">
<description>TEST PAD</description>
<packageinstances>
<packageinstance name="TP15R"/>
</packageinstances>
</package3d>
<package3d name="TP16R" urn="urn:adsk.eagle:package:27969/1" type="box" library_version="2">
<description>TEST PAD</description>
<packageinstances>
<packageinstance name="TP16R"/>
</packageinstances>
</package3d>
<package3d name="TP17R" urn="urn:adsk.eagle:package:27971/1" type="box" library_version="2">
<description>TEST PAD</description>
<packageinstances>
<packageinstance name="TP17R"/>
</packageinstances>
</package3d>
<package3d name="TP18R" urn="urn:adsk.eagle:package:27981/1" type="box" library_version="2">
<description>TEST PAD</description>
<packageinstances>
<packageinstance name="TP18R"/>
</packageinstances>
</package3d>
<package3d name="TP19R" urn="urn:adsk.eagle:package:27972/1" type="box" library_version="2">
<description>TEST PAD</description>
<packageinstances>
<packageinstance name="TP19R"/>
</packageinstances>
</package3d>
<package3d name="TP20R" urn="urn:adsk.eagle:package:27973/1" type="box" library_version="2">
<description>TEST PAD</description>
<packageinstances>
<packageinstance name="TP20R"/>
</packageinstances>
</package3d>
<package3d name="TP13SQ" urn="urn:adsk.eagle:package:27974/1" type="box" library_version="2">
<description>TEST PAD</description>
<packageinstances>
<packageinstance name="TP13SQ"/>
</packageinstances>
</package3d>
<package3d name="TP14SQ" urn="urn:adsk.eagle:package:27984/1" type="box" library_version="2">
<description>TEST PAD</description>
<packageinstances>
<packageinstance name="TP14SQ"/>
</packageinstances>
</package3d>
<package3d name="TP15SQ" urn="urn:adsk.eagle:package:27975/1" type="box" library_version="2">
<description>TEST PAD</description>
<packageinstances>
<packageinstance name="TP15SQ"/>
</packageinstances>
</package3d>
<package3d name="TP16SQ" urn="urn:adsk.eagle:package:27976/1" type="box" library_version="2">
<description>TEST PAD</description>
<packageinstances>
<packageinstance name="TP16SQ"/>
</packageinstances>
</package3d>
<package3d name="TP17SQ" urn="urn:adsk.eagle:package:27977/1" type="box" library_version="2">
<description>TEST PAD</description>
<packageinstances>
<packageinstance name="TP17SQ"/>
</packageinstances>
</package3d>
<package3d name="TP18SQ" urn="urn:adsk.eagle:package:27979/1" type="box" library_version="2">
<description>TEST PAD</description>
<packageinstances>
<packageinstance name="TP18SQ"/>
</packageinstances>
</package3d>
<package3d name="TP19SQ" urn="urn:adsk.eagle:package:27978/1" type="box" library_version="2">
<description>TEST PAD</description>
<packageinstances>
<packageinstance name="TP19SQ"/>
</packageinstances>
</package3d>
<package3d name="TP20SQ" urn="urn:adsk.eagle:package:27980/1" type="box" library_version="2">
<description>TEST PAD</description>
<packageinstances>
<packageinstance name="TP20SQ"/>
</packageinstances>
</package3d>
</packages3d>
<symbols>
<symbol name="TP" urn="urn:adsk.eagle:symbol:27940/1" library_version="2">
<wire x1="-0.762" y1="-0.762" x2="0" y2="0" width="0.254" layer="94"/>
<wire x1="0" y1="0" x2="0.762" y2="-0.762" width="0.254" layer="94"/>
<wire x1="0.762" y1="-0.762" x2="0" y2="-1.524" width="0.254" layer="94"/>
<wire x1="0" y1="-1.524" x2="-0.762" y2="-0.762" width="0.254" layer="94"/>
<text x="-1.27" y="1.27" size="1.778" layer="95">&gt;NAME</text>
<text x="1.27" y="-1.27" size="1.778" layer="97">&gt;TP_SIGNAL_NAME</text>
<pin name="TP" x="0" y="-2.54" visible="off" length="short" direction="in" rot="R90"/>
</symbol>
</symbols>
<devicesets>
<deviceset name="TP" urn="urn:adsk.eagle:component:27992/2" prefix="TP" library_version="2">
<description>&lt;b&gt;Test pad&lt;/b&gt;</description>
<gates>
<gate name="G$1" symbol="TP" x="0" y="0"/>
</gates>
<devices>
<device name="B1,27" package="B1,27">
<connects>
<connect gate="G$1" pin="TP" pad="TP"/>
</connects>
<package3dinstances>
<package3dinstance package3d_urn="urn:adsk.eagle:package:27944/2"/>
</package3dinstances>
<technologies>
<technology name="">
<attribute name="TP_SIGNAL_NAME" value="" constant="no"/>
</technology>
</technologies>
</device>
<device name="B2,54" package="B2,54">
<connects>
<connect gate="G$1" pin="TP" pad="TP"/>
</connects>
<package3dinstances>
<package3dinstance package3d_urn="urn:adsk.eagle:package:27948/1"/>
</package3dinstances>
<technologies>
<technology name="">
<attribute name="TP_SIGNAL_NAME" value="" constant="no"/>
</technology>
</technologies>
</device>
<device name="PAD1-13" package="P1-13">
<connects>
<connect gate="G$1" pin="TP" pad="TP"/>
</connects>
<package3dinstances>
<package3dinstance package3d_urn="urn:adsk.eagle:package:27946/1"/>
</package3dinstances>
<technologies>
<technology name="">
<attribute name="TP_SIGNAL_NAME" value="" constant="no"/>
</technology>
</technologies>
</device>
<device name="PAD1-13Y" package="P1-13Y">
<connects>
<connect gate="G$1" pin="TP" pad="TP"/>
</connects>
<package3dinstances>
<package3dinstance package3d_urn="urn:adsk.eagle:package:27947/1"/>
</package3dinstances>
<technologies>
<technology name="">
<attribute name="TP_SIGNAL_NAME" value="" constant="no"/>
</technology>
</technologies>
</device>
<device name="PAD1-17" package="P1-17">
<connects>
<connect gate="G$1" pin="TP" pad="TP"/>
</connects>
<package3dinstances>
<package3dinstance package3d_urn="urn:adsk.eagle:package:27949/1"/>
</package3dinstances>
<technologies>
<technology name="">
<attribute name="TP_SIGNAL_NAME" value="" constant="no"/>
</technology>
</technologies>
</device>
<device name="PAD1-17Y" package="P1-17Y">
<connects>
<connect gate="G$1" pin="TP" pad="TP"/>
</connects>
<package3dinstances>
<package3dinstance package3d_urn="urn:adsk.eagle:package:27953/1"/>
</package3dinstances>
<technologies>
<technology name="">
<attribute name="TP_SIGNAL_NAME" value="" constant="no"/>
</technology>
</technologies>
</device>
<device name="PAD1-20" package="P1-20">
<connects>
<connect gate="G$1" pin="TP" pad="TP"/>
</connects>
<package3dinstances>
<package3dinstance package3d_urn="urn:adsk.eagle:package:27950/1"/>
</package3dinstances>
<technologies>
<technology name="">
<attribute name="TP_SIGNAL_NAME" value="" constant="no"/>
</technology>
</technologies>
</device>
<device name="PAD1-20Y" package="P1-20Y">
<connects>
<connect gate="G$1" pin="TP" pad="TP"/>
</connects>
<package3dinstances>
<package3dinstance package3d_urn="urn:adsk.eagle:package:27951/1"/>
</package3dinstances>
<technologies>
<technology name="">
<attribute name="TP_SIGNAL_NAME" value="" constant="no"/>
</technology>
</technologies>
</device>
<device name="TP06R" package="TP06R">
<connects>
<connect gate="G$1" pin="TP" pad="TP"/>
</connects>
<package3dinstances>
<package3dinstance package3d_urn="urn:adsk.eagle:package:27954/1"/>
</package3dinstances>
<technologies>
<technology name="">
<attribute name="TP_SIGNAL_NAME" value="" constant="no"/>
</technology>
</technologies>
</device>
<device name="TP06SQ" package="TP06SQ">
<connects>
<connect gate="G$1" pin="TP" pad="TP"/>
</connects>
<package3dinstances>
<package3dinstance package3d_urn="urn:adsk.eagle:package:27952/1"/>
</package3dinstances>
<technologies>
<technology name="">
<attribute name="TP_SIGNAL_NAME" value="" constant="no"/>
</technology>
</technologies>
</device>
<device name="TP07R" package="TP07R">
<connects>
<connect gate="G$1" pin="TP" pad="TP"/>
</connects>
<package3dinstances>
<package3dinstance package3d_urn="urn:adsk.eagle:package:27970/1"/>
</package3dinstances>
<technologies>
<technology name="">
<attribute name="TP_SIGNAL_NAME" value="" constant="no"/>
</technology>
</technologies>
</device>
<device name="TP07SQ" package="TP07SQ">
<connects>
<connect gate="G$1" pin="TP" pad="TP"/>
</connects>
<package3dinstances>
<package3dinstance package3d_urn="urn:adsk.eagle:package:27955/1"/>
</package3dinstances>
<technologies>
<technology name="">
<attribute name="TP_SIGNAL_NAME" value="" constant="no"/>
</technology>
</technologies>
</device>
<device name="TP08R" package="TP08R">
<connects>
<connect gate="G$1" pin="TP" pad="TP"/>
</connects>
<package3dinstances>
<package3dinstance package3d_urn="urn:adsk.eagle:package:27956/1"/>
</package3dinstances>
<technologies>
<technology name="">
<attribute name="TP_SIGNAL_NAME" value="" constant="no"/>
</technology>
</technologies>
</device>
<device name="TP08SQ" package="TP08SQ">
<connects>
<connect gate="G$1" pin="TP" pad="TP"/>
</connects>
<package3dinstances>
<package3dinstance package3d_urn="urn:adsk.eagle:package:27960/1"/>
</package3dinstances>
<technologies>
<technology name="">
<attribute name="TP_SIGNAL_NAME" value="" constant="no"/>
</technology>
</technologies>
</device>
<device name="TP09R" package="TP09R">
<connects>
<connect gate="G$1" pin="TP" pad="TP"/>
</connects>
<package3dinstances>
<package3dinstance package3d_urn="urn:adsk.eagle:package:27958/1"/>
</package3dinstances>
<technologies>
<technology name="">
<attribute name="TP_SIGNAL_NAME" value="" constant="no"/>
</technology>
</technologies>
</device>
<device name="TP09SQ" package="TP09SQ">
<connects>
<connect gate="G$1" pin="TP" pad="TP"/>
</connects>
<package3dinstances>
<package3dinstance package3d_urn="urn:adsk.eagle:package:27957/1"/>
</package3dinstances>
<technologies>
<technology name="">
<attribute name="TP_SIGNAL_NAME" value="" constant="no"/>
</technology>
</technologies>
</device>
<device name="TP10R" package="TP10R">
<connects>
<connect gate="G$1" pin="TP" pad="TP"/>
</connects>
<package3dinstances>
<package3dinstance package3d_urn="urn:adsk.eagle:package:27959/1"/>
</package3dinstances>
<technologies>
<technology name="">
<attribute name="TP_SIGNAL_NAME" value="" constant="no"/>
</technology>
</technologies>
</device>
<device name="TP10SQ" package="TP10SQ">
<connects>
<connect gate="G$1" pin="TP" pad="TP"/>
</connects>
<package3dinstances>
<package3dinstance package3d_urn="urn:adsk.eagle:package:27962/1"/>
</package3dinstances>
<technologies>
<technology name="">
<attribute name="TP_SIGNAL_NAME" value="" constant="no"/>
</technology>
</technologies>
</device>
<device name="TP11R" package="TP11R">
<connects>
<connect gate="G$1" pin="TP" pad="TP"/>
</connects>
<package3dinstances>
<package3dinstance package3d_urn="urn:adsk.eagle:package:27961/1"/>
</package3dinstances>
<technologies>
<technology name="">
<attribute name="TP_SIGNAL_NAME" value="" constant="no"/>
</technology>
</technologies>
</device>
<device name="TP11SQ" package="TP11SQ">
<connects>
<connect gate="G$1" pin="TP" pad="TP"/>
</connects>
<package3dinstances>
<package3dinstance package3d_urn="urn:adsk.eagle:package:27965/1"/>
</package3dinstances>
<technologies>
<technology name="">
<attribute name="TP_SIGNAL_NAME" value="" constant="no"/>
</technology>
</technologies>
</device>
<device name="TP12SQ" package="TP12SQ">
<connects>
<connect gate="G$1" pin="TP" pad="TP"/>
</connects>
<package3dinstances>
<package3dinstance package3d_urn="urn:adsk.eagle:package:27964/1"/>
</package3dinstances>
<technologies>
<technology name="">
<attribute name="TP_SIGNAL_NAME" value="" constant="no"/>
</technology>
</technologies>
</device>
<device name="TP12R" package="TP12R">
<connects>
<connect gate="G$1" pin="TP" pad="TP"/>
</connects>
<package3dinstances>
<package3dinstance package3d_urn="urn:adsk.eagle:package:27963/1"/>
</package3dinstances>
<technologies>
<technology name="">
<attribute name="TP_SIGNAL_NAME" value="" constant="no"/>
</technology>
</technologies>
</device>
<device name="TP13R" package="TP13R">
<connects>
<connect gate="G$1" pin="TP" pad="TP"/>
</connects>
<package3dinstances>
<package3dinstance package3d_urn="urn:adsk.eagle:package:27967/1"/>
</package3dinstances>
<technologies>
<technology name="">
<attribute name="TP_SIGNAL_NAME" value="" constant="no"/>
</technology>
</technologies>
</device>
<device name="TP14R" package="TP14R">
<connects>
<connect gate="G$1" pin="TP" pad="TP"/>
</connects>
<package3dinstances>
<package3dinstance package3d_urn="urn:adsk.eagle:package:27966/1"/>
</package3dinstances>
<technologies>
<technology name="">
<attribute name="TP_SIGNAL_NAME" value="" constant="no"/>
</technology>
</technologies>
</device>
<device name="TP15R" package="TP15R">
<connects>
<connect gate="G$1" pin="TP" pad="TP"/>
</connects>
<package3dinstances>
<package3dinstance package3d_urn="urn:adsk.eagle:package:27968/1"/>
</package3dinstances>
<technologies>
<technology name="">
<attribute name="TP_SIGNAL_NAME" value="" constant="no"/>
</technology>
</technologies>
</device>
<device name="TP16R" package="TP16R">
<connects>
<connect gate="G$1" pin="TP" pad="TP"/>
</connects>
<package3dinstances>
<package3dinstance package3d_urn="urn:adsk.eagle:package:27969/1"/>
</package3dinstances>
<technologies>
<technology name="">
<attribute name="TP_SIGNAL_NAME" value="" constant="no"/>
</technology>
</technologies>
</device>
<device name="TP17R" package="TP17R">
<connects>
<connect gate="G$1" pin="TP" pad="TP"/>
</connects>
<package3dinstances>
<package3dinstance package3d_urn="urn:adsk.eagle:package:27971/1"/>
</package3dinstances>
<technologies>
<technology name="">
<attribute name="TP_SIGNAL_NAME" value="" constant="no"/>
</technology>
</technologies>
</device>
<device name="TP18R" package="TP18R">
<connects>
<connect gate="G$1" pin="TP" pad="TP"/>
</connects>
<package3dinstances>
<package3dinstance package3d_urn="urn:adsk.eagle:package:27981/1"/>
</package3dinstances>
<technologies>
<technology name="">
<attribute name="TP_SIGNAL_NAME" value="" constant="no"/>
</technology>
</technologies>
</device>
<device name="TP19R" package="TP19R">
<connects>
<connect gate="G$1" pin="TP" pad="TP"/>
</connects>
<package3dinstances>
<package3dinstance package3d_urn="urn:adsk.eagle:package:27972/1"/>
</package3dinstances>
<technologies>
<technology name="">
<attribute name="TP_SIGNAL_NAME" value="" constant="no"/>
</technology>
</technologies>
</device>
<device name="TP20R" package="TP20R">
<connects>
<connect gate="G$1" pin="TP" pad="TP"/>
</connects>
<package3dinstances>
<package3dinstance package3d_urn="urn:adsk.eagle:package:27973/1"/>
</package3dinstances>
<technologies>
<technology name="">
<attribute name="TP_SIGNAL_NAME" value="" constant="no"/>
</technology>
</technologies>
</device>
<device name="TP13SQ" package="TP13SQ">
<connects>
<connect gate="G$1" pin="TP" pad="TP"/>
</connects>
<package3dinstances>
<package3dinstance package3d_urn="urn:adsk.eagle:package:27974/1"/>
</package3dinstances>
<technologies>
<technology name="">
<attribute name="TP_SIGNAL_NAME" value="" constant="no"/>
</technology>
</technologies>
</device>
<device name="TP14SQ" package="TP14SQ">
<connects>
<connect gate="G$1" pin="TP" pad="TP"/>
</connects>
<package3dinstances>
<package3dinstance package3d_urn="urn:adsk.eagle:package:27984/1"/>
</package3dinstances>
<technologies>
<technology name="">
<attribute name="TP_SIGNAL_NAME" value="" constant="no"/>
</technology>
</technologies>
</device>
<device name="TP15SQ" package="TP15SQ">
<connects>
<connect gate="G$1" pin="TP" pad="TP"/>
</connects>
<package3dinstances>
<package3dinstance package3d_urn="urn:adsk.eagle:package:27975/1"/>
</package3dinstances>
<technologies>
<technology name="">
<attribute name="TP_SIGNAL_NAME" value="" constant="no"/>
</technology>
</technologies>
</device>
<device name="TP16SQ" package="TP16SQ">
<connects>
<connect gate="G$1" pin="TP" pad="TP"/>
</connects>
<package3dinstances>
<package3dinstance package3d_urn="urn:adsk.eagle:package:27976/1"/>
</package3dinstances>
<technologies>
<technology name="">
<attribute name="TP_SIGNAL_NAME" value="" constant="no"/>
</technology>
</technologies>
</device>
<device name="TP17SQ" package="TP17SQ">
<connects>
<connect gate="G$1" pin="TP" pad="TP"/>
</connects>
<package3dinstances>
<package3dinstance package3d_urn="urn:adsk.eagle:package:27977/1"/>
</package3dinstances>
<technologies>
<technology name="">
<attribute name="TP_SIGNAL_NAME" value="" constant="no"/>
</technology>
</technologies>
</device>
<device name="TP18SQ" package="TP18SQ">
<connects>
<connect gate="G$1" pin="TP" pad="TP"/>
</connects>
<package3dinstances>
<package3dinstance package3d_urn="urn:adsk.eagle:package:27979/1"/>
</package3dinstances>
<technologies>
<technology name="">
<attribute name="TP_SIGNAL_NAME" value="" constant="no"/>
</technology>
</technologies>
</device>
<device name="TP19SQ" package="TP19SQ">
<connects>
<connect gate="G$1" pin="TP" pad="TP"/>
</connects>
<package3dinstances>
<package3dinstance package3d_urn="urn:adsk.eagle:package:27978/1"/>
</package3dinstances>
<technologies>
<technology name="">
<attribute name="TP_SIGNAL_NAME" value="" constant="no"/>
</technology>
</technologies>
</device>
<device name="TP20SQ" package="TP20SQ">
<connects>
<connect gate="G$1" pin="TP" pad="TP"/>
</connects>
<package3dinstances>
<package3dinstance package3d_urn="urn:adsk.eagle:package:27980/1"/>
</package3dinstances>
<technologies>
<technology name="">
<attribute name="TP_SIGNAL_NAME" value="" constant="no"/>
</technology>
</technologies>
</device>
</devices>
</deviceset>
</devicesets>
</library>
</libraries>
<attributes>
</attributes>
<variantdefs>
</variantdefs>
<classes>
<class number="0" name="default" width="0" drill="0">
</class>
</classes>
<parts>
<part name="TP1" library="testpad" library_urn="urn:adsk.eagle:library:385" deviceset="TP" device="B1,27" package3d_urn="urn:adsk.eagle:package:27944/2"/>
<part name="TP2" library="testpad" library_urn="urn:adsk.eagle:library:385" deviceset="TP" device="B1,27" package3d_urn="urn:adsk.eagle:package:27944/2"/>
</parts>
<sheets>
<sheet>
<plain>
</plain>
<instances>
<instance part="TP1" gate="G$1" x="58.42" y="50.8" smashed="yes">
<attribute name="NAME" x="57.15" y="52.07" size="1.778" layer="95"/>
<attribute name="TP_SIGNAL_NAME" x="59.69" y="49.53" size="1.778" layer="97"/>
</instance>
<instance part="TP2" gate="G$1" x="58.42" y="40.64" smashed="yes" rot="R180">
<attribute name="NAME" x="59.69" y="39.37" size="1.778" layer="95" rot="R180"/>
<attribute name="TP_SIGNAL_NAME" x="57.15" y="41.91" size="1.778" layer="97" rot="R180"/>
</instance>
</instances>
<busses>
</busses>
<nets>
<net name="COIL" class="0">
<segment>
<pinref part="TP1" gate="G$1" pin="TP"/>
<pinref part="TP2" gate="G$1" pin="TP"/>
<wire x1="58.42" y1="48.26" x2="58.42" y2="43.18" width="0.1524" layer="91"/>
<label x="60.96" y="45.72" size="1.778" layer="95"/>
</segment>
</net>
</nets>
</sheet>
</sheets>
</schematic>
</drawing>
<compatibility>
<note version="8.2" severity="warning">
Since Version 8.2, EAGLE supports online libraries. The ids
of those online libraries will not be understood (or retained)
with this version.
</note>
<note version="8.3" severity="warning">
Since Version 8.3, EAGLE supports URNs for individual library
assets (packages, symbols, and devices). The URNs of those assets
will not be understood (or retained) with this version.
</note>
<note version="8.3" severity="warning">
Since Version 8.3, EAGLE supports the association of 3D packages
with devices in libraries, schematics, and board files. Those 3D
packages will not be understood (or retained) with this version.
</note>
</compatibility>
</eagle>
