<?xml version="1.0" encoding="utf-8"?>
<!DOCTYPE eagle SYSTEM "eagle.dtd">
<eagle version="9.4.1">
<drawing>
<settings>
<setting alwaysvectorfont="no"/>
<setting verticaltext="up"/>
</settings>
<grid distance="0.1" unitdist="mm" unit="mm" style="lines" multiple="1" display="no" altdistance="1" altunitdist="mm" altunit="mm"/>
<layers>
<layer number="1" name="Top" color="4" fill="1" visible="yes" active="yes"/>
<layer number="2" name="Route2" color="16" fill="1" visible="no" active="no"/>
<layer number="3" name="Route3" color="17" fill="1" visible="no" active="no"/>
<layer number="4" name="Route4" color="18" fill="1" visible="no" active="no"/>
<layer number="5" name="Route5" color="19" fill="1" visible="no" active="no"/>
<layer number="6" name="Route6" color="25" fill="1" visible="no" active="no"/>
<layer number="7" name="Route7" color="26" fill="1" visible="no" active="no"/>
<layer number="8" name="Route8" color="27" fill="1" visible="no" active="no"/>
<layer number="9" name="Route9" color="28" fill="1" visible="no" active="no"/>
<layer number="10" name="Route10" color="29" fill="1" visible="no" active="no"/>
<layer number="11" name="Route11" color="30" fill="1" visible="no" active="no"/>
<layer number="12" name="Route12" color="20" fill="1" visible="no" active="no"/>
<layer number="13" name="Route13" color="21" fill="1" visible="no" active="no"/>
<layer number="14" name="Route14" color="22" fill="1" visible="no" active="no"/>
<layer number="15" name="Route15" color="23" fill="1" visible="no" active="no"/>
<layer number="16" name="Bottom" color="1" fill="1" visible="yes" active="yes"/>
<layer number="17" name="Pads" color="2" fill="1" visible="yes" active="yes"/>
<layer number="18" name="Vias" color="2" fill="1" visible="yes" active="yes"/>
<layer number="19" name="Unrouted" color="6" fill="1" visible="yes" active="yes"/>
<layer number="20" name="Dimension" color="24" fill="1" visible="yes" active="yes"/>
<layer number="21" name="tPlace" color="7" fill="1" visible="yes" active="yes"/>
<layer number="22" name="bPlace" color="7" fill="1" visible="yes" active="yes"/>
<layer number="23" name="tOrigins" color="15" fill="1" visible="yes" active="yes"/>
<layer number="24" name="bOrigins" color="15" fill="1" visible="yes" active="yes"/>
<layer number="25" name="tNames" color="7" fill="1" visible="yes" active="yes"/>
<layer number="26" name="bNames" color="7" fill="1" visible="yes" active="yes"/>
<layer number="27" name="tValues" color="7" fill="1" visible="yes" active="yes"/>
<layer number="28" name="bValues" color="7" fill="1" visible="yes" active="yes"/>
<layer number="29" name="tStop" color="7" fill="3" visible="no" active="yes"/>
<layer number="30" name="bStop" color="7" fill="6" visible="no" active="yes"/>
<layer number="31" name="tCream" color="7" fill="4" visible="no" active="yes"/>
<layer number="32" name="bCream" color="7" fill="5" visible="no" active="yes"/>
<layer number="33" name="tFinish" color="6" fill="3" visible="no" active="yes"/>
<layer number="34" name="bFinish" color="6" fill="6" visible="no" active="yes"/>
<layer number="35" name="tGlue" color="7" fill="4" visible="no" active="yes"/>
<layer number="36" name="bGlue" color="7" fill="5" visible="no" active="yes"/>
<layer number="37" name="tTest" color="7" fill="1" visible="no" active="yes"/>
<layer number="38" name="bTest" color="7" fill="1" visible="no" active="yes"/>
<layer number="39" name="tKeepout" color="4" fill="11" visible="yes" active="yes"/>
<layer number="40" name="bKeepout" color="1" fill="11" visible="yes" active="yes"/>
<layer number="41" name="tRestrict" color="4" fill="10" visible="yes" active="yes"/>
<layer number="42" name="bRestrict" color="1" fill="10" visible="yes" active="yes"/>
<layer number="43" name="vRestrict" color="2" fill="10" visible="yes" active="yes"/>
<layer number="44" name="Drills" color="7" fill="1" visible="no" active="yes"/>
<layer number="45" name="Holes" color="7" fill="1" visible="no" active="yes"/>
<layer number="46" name="Milling" color="3" fill="1" visible="no" active="yes"/>
<layer number="47" name="Measures" color="7" fill="1" visible="no" active="yes"/>
<layer number="48" name="Document" color="7" fill="1" visible="yes" active="yes"/>
<layer number="49" name="Reference" color="7" fill="1" visible="yes" active="yes"/>
<layer number="51" name="tDocu" color="7" fill="1" visible="yes" active="yes"/>
<layer number="52" name="bDocu" color="7" fill="1" visible="yes" active="yes"/>
<layer number="88" name="SimResults" color="9" fill="1" visible="no" active="no"/>
<layer number="89" name="SimProbes" color="9" fill="1" visible="no" active="no"/>
<layer number="90" name="Modules" color="5" fill="1" visible="no" active="no"/>
<layer number="91" name="Nets" color="2" fill="1" visible="no" active="no"/>
<layer number="92" name="Busses" color="1" fill="1" visible="no" active="no"/>
<layer number="93" name="Pins" color="2" fill="1" visible="no" active="no"/>
<layer number="94" name="Symbols" color="4" fill="1" visible="no" active="no"/>
<layer number="95" name="Names" color="7" fill="1" visible="no" active="no"/>
<layer number="96" name="Values" color="7" fill="1" visible="no" active="no"/>
<layer number="97" name="Info" color="7" fill="1" visible="no" active="no"/>
<layer number="98" name="Guide" color="6" fill="1" visible="no" active="no"/>
</layers>
<board>
<plain>
<circle x="0" y="0" radius="18.5" width="0.01" layer="20"/>
<wire x1="-4.9" y1="-15.6" x2="4.3" y2="-15.6" width="0.01" layer="20"/>
<wire x1="4.3" y1="-15.6" x2="4.3" y2="-12.3" width="0.01" layer="20"/>
<wire x1="4.3" y1="-12.3" x2="-4.9" y2="-12.3" width="0.01" layer="20"/>
<wire x1="-4.9" y1="-12.3" x2="-4.9" y2="-15.6" width="0.01" layer="20"/>
<wire x1="12.1" y1="-15.1" x2="12.1" y2="14.9" width="0.1524" layer="21"/>
<wire x1="12.1" y1="14.9" x2="-12.9" y2="14.9" width="0.1524" layer="21"/>
<wire x1="-12.9" y1="14.9" x2="-12.9" y2="-15.1" width="0.1524" layer="21"/>
<wire x1="-12.9" y1="-15.1" x2="12.1" y2="-15.1" width="0.1524" layer="21"/>
</plain>
<libraries>
<library name="ESP-WROOM-32">
<packages>
<package name="MODULE_ESP-WROOM-32">
<wire x1="-9" y1="-9.755" x2="9" y2="-9.755" width="0.127" layer="51"/>
<wire x1="9" y1="-9.755" x2="9" y2="15.745" width="0.127" layer="51"/>
<wire x1="9" y1="15.745" x2="-9" y2="15.745" width="0.127" layer="51"/>
<wire x1="-9" y1="15.745" x2="-9" y2="-9.755" width="0.127" layer="51"/>
<wire x1="-9" y1="-9" x2="-9" y2="-9.75" width="0.127" layer="21"/>
<wire x1="-9" y1="-9.75" x2="-6.5" y2="-9.75" width="0.127" layer="21"/>
<wire x1="6.5" y1="-9.75" x2="9" y2="-9.75" width="0.127" layer="21"/>
<wire x1="9" y1="-9.75" x2="9" y2="-9" width="0.127" layer="21"/>
<wire x1="-9" y1="9.25" x2="-9" y2="15.75" width="0.127" layer="21"/>
<wire x1="-9" y1="15.75" x2="9" y2="15.75" width="0.127" layer="21"/>
<wire x1="9" y1="15.75" x2="9" y2="9.25" width="0.127" layer="21"/>
<rectangle x1="-8.002640625" y1="10.5035" x2="-7.5" y2="15" layer="21"/>
<rectangle x1="-8.00838125" y1="14.5152" x2="-5" y2="15" layer="21"/>
<rectangle x1="-5.51458125" y1="12.0318" x2="-5" y2="14.5" layer="21"/>
<rectangle x1="-5.50796875" y1="12.0174" x2="-2.5" y2="12.5" layer="21"/>
<rectangle x1="-3.00556875" y1="12.0222" x2="-2.5" y2="14.5" layer="21"/>
<rectangle x1="-3.00538125" y1="14.526" x2="0" y2="15" layer="21"/>
<rectangle x1="-0.5019" y1="12.0456" x2="0" y2="14.5" layer="21"/>
<rectangle x1="-0.501415625" y1="12.0339" x2="2.5" y2="12.5" layer="21"/>
<rectangle x1="2.00635" y1="12.0381" x2="2.5" y2="14.5" layer="21"/>
<rectangle x1="2.00956875" y1="14.4994" x2="7.5" y2="15" layer="21"/>
<rectangle x1="7.01686875" y1="10.0241" x2="7.5" y2="15" layer="21"/>
<rectangle x1="4.51203125" y1="10.0268" x2="5" y2="15" layer="21"/>
<rectangle x1="7.00575" y1="9.507809375" x2="7.5" y2="10" layer="21"/>
<rectangle x1="4.5065" y1="9.51371875" x2="5" y2="10" layer="21"/>
<rectangle x1="-8.023740625" y1="10.0296" x2="-7.5" y2="10.5" layer="21"/>
<rectangle x1="2.00168125" y1="13.5114" x2="2.5" y2="15" layer="21"/>
<rectangle x1="-8.024790625" y1="10.5325" x2="-7.5" y2="15" layer="51"/>
<rectangle x1="-8.0219" y1="14.5397" x2="-5" y2="15" layer="51"/>
<rectangle x1="-5.51781875" y1="12.0389" x2="-5" y2="14.5" layer="51"/>
<rectangle x1="-5.514790625" y1="12.0323" x2="-2.5" y2="12.5" layer="51"/>
<rectangle x1="-3.003990625" y1="12.016" x2="-2.5" y2="14.5" layer="51"/>
<rectangle x1="-3.00396875" y1="14.5192" x2="0" y2="15" layer="51"/>
<rectangle x1="-0.500765625" y1="12.0184" x2="0" y2="14.5" layer="51"/>
<rectangle x1="-0.50015625" y1="12.0037" x2="2.5" y2="12.5" layer="51"/>
<rectangle x1="2.005740625" y1="12.0344" x2="2.5" y2="14.5" layer="51"/>
<rectangle x1="2.010809375" y1="14.5084" x2="7.5" y2="15" layer="51"/>
<rectangle x1="7.01163125" y1="10.0166" x2="7.5" y2="15" layer="51"/>
<rectangle x1="4.5081" y1="10.018" x2="5" y2="15" layer="51"/>
<rectangle x1="7.0176" y1="9.523890625" x2="7.5" y2="10" layer="51"/>
<rectangle x1="4.513140625" y1="9.527740625" x2="5" y2="10" layer="51"/>
<rectangle x1="-8.01843125" y1="10.023" x2="-7.5" y2="10.5" layer="51"/>
<rectangle x1="2.00256875" y1="13.5173" x2="2.5" y2="15" layer="51"/>
<wire x1="-9.25" y1="16" x2="9.25" y2="16" width="0.05" layer="39"/>
<wire x1="9.25" y1="16" x2="9.25" y2="9" width="0.05" layer="39"/>
<wire x1="9.25" y1="9" x2="10.1" y2="9" width="0.05" layer="39"/>
<wire x1="10.1" y1="9" x2="10.1" y2="-9" width="0.05" layer="39"/>
<wire x1="10.1" y1="-9" x2="9.25" y2="-9" width="0.05" layer="39"/>
<wire x1="9.25" y1="-9" x2="9.25" y2="-10" width="0.05" layer="39"/>
<wire x1="9.25" y1="-10" x2="6.5" y2="-10" width="0.05" layer="39"/>
<wire x1="6.5" y1="-10" x2="6.5" y2="-10.855" width="0.05" layer="39"/>
<wire x1="6.5" y1="-10.855" x2="-6.5" y2="-10.855" width="0.05" layer="39"/>
<wire x1="-6.5" y1="-10.855" x2="-6.5" y2="-10" width="0.05" layer="39"/>
<wire x1="-6.5" y1="-10" x2="-9.25" y2="-10" width="0.05" layer="39"/>
<wire x1="-9.25" y1="-10" x2="-9.25" y2="-9" width="0.05" layer="39"/>
<wire x1="-9.25" y1="-9" x2="-10.1" y2="-9" width="0.05" layer="39"/>
<wire x1="-10.1" y1="-9" x2="-10.1" y2="9" width="0.05" layer="39"/>
<wire x1="-10.1" y1="9" x2="-9.25" y2="9" width="0.05" layer="39"/>
<wire x1="-9.25" y1="9" x2="-9.25" y2="16" width="0.05" layer="39"/>
<text x="-9.01326875" y="16.2739" size="1.67886875" layer="25">&gt;NAME</text>
<text x="-9.02085" y="-12.529" size="1.680290625" layer="27">&gt;VALUE</text>
<rectangle x1="-9.007809375" y1="9.007809375" x2="9" y2="15.75" layer="41"/>
<rectangle x1="-9.01791875" y1="9.01791875" x2="9" y2="15.75" layer="42"/>
<rectangle x1="-9.01766875" y1="9.01766875" x2="9" y2="15.75" layer="43"/>
<circle x="-10.365" y="8.2754" radius="0.1" width="0.2" layer="21"/>
<smd name="1" x="-9" y="8.255" dx="1.7" dy="0.9" layer="1" roundness="22"/>
<smd name="2" x="-9" y="6.985" dx="1.7" dy="0.9" layer="1" roundness="22"/>
<smd name="3" x="-9" y="5.715" dx="1.7" dy="0.9" layer="1" roundness="22"/>
<smd name="4" x="-9" y="4.445" dx="1.7" dy="0.9" layer="1" roundness="22"/>
<smd name="5" x="-9" y="3.175" dx="1.7" dy="0.9" layer="1" roundness="22"/>
<smd name="6" x="-9" y="1.905" dx="1.7" dy="0.9" layer="1" roundness="22"/>
<smd name="7" x="-9" y="0.635" dx="1.7" dy="0.9" layer="1" roundness="22"/>
<smd name="8" x="-9" y="-0.635" dx="1.7" dy="0.9" layer="1" roundness="22"/>
<smd name="9" x="-9" y="-1.905" dx="1.7" dy="0.9" layer="1" roundness="22"/>
<smd name="10" x="-9" y="-3.175" dx="1.7" dy="0.9" layer="1" roundness="22"/>
<smd name="11" x="-9" y="-4.445" dx="1.7" dy="0.9" layer="1" roundness="22"/>
<smd name="12" x="-9" y="-5.715" dx="1.7" dy="0.9" layer="1" roundness="22"/>
<smd name="13" x="-9" y="-6.985" dx="1.7" dy="0.9" layer="1" roundness="22"/>
<smd name="14" x="-9" y="-8.255" dx="1.7" dy="0.9" layer="1" roundness="22"/>
<smd name="15" x="-5.715" y="-9.755" dx="1.7" dy="0.9" layer="1" roundness="22" rot="R90"/>
<smd name="16" x="-4.445" y="-9.755" dx="1.7" dy="0.9" layer="1" roundness="22" rot="R90"/>
<smd name="17" x="-3.175" y="-9.755" dx="1.7" dy="0.9" layer="1" roundness="22" rot="R90"/>
<smd name="18" x="-1.905" y="-9.755" dx="1.7" dy="0.9" layer="1" roundness="22" rot="R90"/>
<smd name="19" x="-0.635" y="-9.755" dx="1.7" dy="0.9" layer="1" roundness="22" rot="R90"/>
<smd name="20" x="0.635" y="-9.755" dx="1.7" dy="0.9" layer="1" roundness="22" rot="R90"/>
<smd name="21" x="1.905" y="-9.755" dx="1.7" dy="0.9" layer="1" roundness="22" rot="R90"/>
<smd name="22" x="3.175" y="-9.755" dx="1.7" dy="0.9" layer="1" roundness="22" rot="R90"/>
<smd name="23" x="4.445" y="-9.755" dx="1.7" dy="0.9" layer="1" roundness="22" rot="R90"/>
<smd name="24" x="5.715" y="-9.755" dx="1.7" dy="0.9" layer="1" roundness="22" rot="R90"/>
<smd name="25" x="9" y="-8.255" dx="1.7" dy="0.9" layer="1" roundness="22" rot="R180"/>
<smd name="26" x="9" y="-6.985" dx="1.7" dy="0.9" layer="1" roundness="22" rot="R180"/>
<smd name="27" x="9" y="-5.715" dx="1.7" dy="0.9" layer="1" roundness="22" rot="R180"/>
<smd name="28" x="9" y="-4.445" dx="1.7" dy="0.9" layer="1" roundness="22" rot="R180"/>
<smd name="29" x="9" y="-3.175" dx="1.7" dy="0.9" layer="1" roundness="22" rot="R180"/>
<smd name="30" x="9" y="-1.905" dx="1.7" dy="0.9" layer="1" roundness="22" rot="R180"/>
<smd name="31" x="9" y="-0.635" dx="1.7" dy="0.9" layer="1" roundness="22" rot="R180"/>
<smd name="32" x="9" y="0.635" dx="1.7" dy="0.9" layer="1" roundness="22" rot="R180"/>
<smd name="33" x="9" y="1.905" dx="1.7" dy="0.9" layer="1" roundness="22" rot="R180"/>
<smd name="34" x="9" y="3.175" dx="1.7" dy="0.9" layer="1" roundness="22" rot="R180"/>
<smd name="35" x="9" y="4.445" dx="1.7" dy="0.9" layer="1" roundness="22" rot="R180"/>
<smd name="36" x="9" y="5.715" dx="1.7" dy="0.9" layer="1" roundness="22" rot="R180"/>
<smd name="37" x="9" y="6.985" dx="1.7" dy="0.9" layer="1" roundness="22" rot="R180"/>
<smd name="38" x="9" y="8.255" dx="1.7" dy="0.9" layer="1" roundness="22" rot="R180"/>
<smd name="1.1" x="0.7" y="0.845" dx="4" dy="4" layer="1"/>
</package>
</packages>
</library>
</libraries>
<attributes>
</attributes>
<variantdefs>
</variantdefs>
<classes>
<class number="0" name="default" width="0" drill="0">
</class>
</classes>
<designrules name="default">
<description language="de">&lt;b&gt;EAGLE Design Rules&lt;/b&gt;
&lt;p&gt;
Die Standard-Design-Rules sind so gewählt, dass sie für 
die meisten Anwendungen passen. Sollte ihre Platine 
besondere Anforderungen haben, treffen Sie die erforderlichen
Einstellungen hier und speichern die Design Rules unter 
einem neuen Namen ab.</description>
<description language="en">&lt;b&gt;EAGLE Design Rules&lt;/b&gt;
&lt;p&gt;
The default Design Rules have been set to cover
a wide range of applications. Your particular design
may have different requirements, so please make the
necessary adjustments and save your customized
design rules under a new name.</description>
<param name="layerSetup" value="(1*16)"/>
<param name="mtCopper" value="0.035mm 0.035mm 0.035mm 0.035mm 0.035mm 0.035mm 0.035mm 0.035mm 0.035mm 0.035mm 0.035mm 0.035mm 0.035mm 0.035mm 0.035mm 0.035mm"/>
<param name="mtIsolate" value="1.5mm 0.15mm 0.2mm 0.15mm 0.2mm 0.15mm 0.2mm 0.15mm 0.2mm 0.15mm 0.2mm 0.15mm 0.2mm 0.15mm 0.2mm"/>
<param name="mdWireWire" value="6mil"/>
<param name="mdWirePad" value="6mil"/>
<param name="mdWireVia" value="6mil"/>
<param name="mdPadPad" value="6mil"/>
<param name="mdPadVia" value="6mil"/>
<param name="mdViaVia" value="6mil"/>
<param name="mdSmdPad" value="6mil"/>
<param name="mdSmdVia" value="6mil"/>
<param name="mdSmdSmd" value="6mil"/>
<param name="mdViaViaSameLayer" value="6mil"/>
<param name="mnLayersViaInSmd" value="2"/>
<param name="mdCopperDimension" value="40mil"/>
<param name="mdDrill" value="6mil"/>
<param name="mdSmdStop" value="0mil"/>
<param name="msWidth" value="6mil"/>
<param name="msDrill" value="0.35mm"/>
<param name="msMicroVia" value="9.99mm"/>
<param name="msBlindViaRatio" value="0.5"/>
<param name="rvPadTop" value="0.25"/>
<param name="rvPadInner" value="0.25"/>
<param name="rvPadBottom" value="0.25"/>
<param name="rvViaOuter" value="0.25"/>
<param name="rvViaInner" value="0.25"/>
<param name="rvMicroViaOuter" value="0.25"/>
<param name="rvMicroViaInner" value="0.25"/>
<param name="rlMinPadTop" value="10mil"/>
<param name="rlMaxPadTop" value="20mil"/>
<param name="rlMinPadInner" value="10mil"/>
<param name="rlMaxPadInner" value="20mil"/>
<param name="rlMinPadBottom" value="10mil"/>
<param name="rlMaxPadBottom" value="20mil"/>
<param name="rlMinViaOuter" value="8mil"/>
<param name="rlMaxViaOuter" value="20mil"/>
<param name="rlMinViaInner" value="8mil"/>
<param name="rlMaxViaInner" value="20mil"/>
<param name="rlMinMicroViaOuter" value="4mil"/>
<param name="rlMaxMicroViaOuter" value="20mil"/>
<param name="rlMinMicroViaInner" value="4mil"/>
<param name="rlMaxMicroViaInner" value="20mil"/>
<param name="psTop" value="-1"/>
<param name="psBottom" value="-1"/>
<param name="psFirst" value="-1"/>
<param name="psElongationLong" value="100"/>
<param name="psElongationOffset" value="100"/>
<param name="mvStopFrame" value="1"/>
<param name="mvCreamFrame" value="0"/>
<param name="mlMinStopFrame" value="4mil"/>
<param name="mlMaxStopFrame" value="4mil"/>
<param name="mlMinCreamFrame" value="0mil"/>
<param name="mlMaxCreamFrame" value="0mil"/>
<param name="mlViaStopLimit" value="0mil"/>
<param name="srRoundness" value="0"/>
<param name="srMinRoundness" value="0mil"/>
<param name="srMaxRoundness" value="0mil"/>
<param name="slThermalIsolate" value="10mil"/>
<param name="slThermalsForVias" value="0"/>
<param name="dpMaxLengthDifference" value="10mm"/>
<param name="dpGapFactor" value="2.5"/>
<param name="checkAngle" value="0"/>
<param name="checkFont" value="1"/>
<param name="checkRestrict" value="1"/>
<param name="checkStop" value="0"/>
<param name="checkValues" value="0"/>
<param name="checkNames" value="1"/>
<param name="checkWireStubs" value="1"/>
<param name="checkPolygonWidth" value="0"/>
<param name="useDiameter" value="13"/>
<param name="maxErrors" value="50"/>
</designrules>
<autorouter>
<pass name="Default">
<param name="RoutingGrid" value="50mil"/>
<param name="AutoGrid" value="1"/>
<param name="Efforts" value="0"/>
<param name="TopRouterVariant" value="1"/>
<param name="tpViaShape" value="round"/>
<param name="PrefDir.1" value="a"/>
<param name="PrefDir.2" value="0"/>
<param name="PrefDir.3" value="0"/>
<param name="PrefDir.4" value="0"/>
<param name="PrefDir.5" value="0"/>
<param name="PrefDir.6" value="0"/>
<param name="PrefDir.7" value="0"/>
<param name="PrefDir.8" value="0"/>
<param name="PrefDir.9" value="0"/>
<param name="PrefDir.10" value="0"/>
<param name="PrefDir.11" value="0"/>
<param name="PrefDir.12" value="0"/>
<param name="PrefDir.13" value="0"/>
<param name="PrefDir.14" value="0"/>
<param name="PrefDir.15" value="0"/>
<param name="PrefDir.16" value="a"/>
<param name="cfVia" value="8"/>
<param name="cfNonPref" value="5"/>
<param name="cfChangeDir" value="2"/>
<param name="cfOrthStep" value="2"/>
<param name="cfDiagStep" value="3"/>
<param name="cfExtdStep" value="0"/>
<param name="cfBonusStep" value="1"/>
<param name="cfMalusStep" value="1"/>
<param name="cfPadImpact" value="4"/>
<param name="cfSmdImpact" value="4"/>
<param name="cfBusImpact" value="0"/>
<param name="cfHugging" value="3"/>
<param name="cfAvoid" value="4"/>
<param name="cfPolygon" value="10"/>
<param name="cfBase.1" value="0"/>
<param name="cfBase.2" value="1"/>
<param name="cfBase.3" value="1"/>
<param name="cfBase.4" value="1"/>
<param name="cfBase.5" value="1"/>
<param name="cfBase.6" value="1"/>
<param name="cfBase.7" value="1"/>
<param name="cfBase.8" value="1"/>
<param name="cfBase.9" value="1"/>
<param name="cfBase.10" value="1"/>
<param name="cfBase.11" value="1"/>
<param name="cfBase.12" value="1"/>
<param name="cfBase.13" value="1"/>
<param name="cfBase.14" value="1"/>
<param name="cfBase.15" value="1"/>
<param name="cfBase.16" value="0"/>
<param name="mnVias" value="20"/>
<param name="mnSegments" value="9999"/>
<param name="mnExtdSteps" value="9999"/>
<param name="mnRipupLevel" value="10"/>
<param name="mnRipupSteps" value="100"/>
<param name="mnRipupTotal" value="100"/>
</pass>
<pass name="Follow-me" refer="Default" active="yes">
</pass>
<pass name="Busses" refer="Default" active="yes">
<param name="cfNonPref" value="4"/>
<param name="cfBusImpact" value="4"/>
<param name="cfHugging" value="0"/>
<param name="mnVias" value="0"/>
</pass>
<pass name="Route" refer="Default" active="yes">
</pass>
<pass name="Optimize1" refer="Default" active="yes">
<param name="cfVia" value="99"/>
<param name="cfExtdStep" value="10"/>
<param name="cfHugging" value="1"/>
<param name="mnExtdSteps" value="1"/>
<param name="mnRipupLevel" value="0"/>
</pass>
<pass name="Optimize2" refer="Optimize1" active="yes">
<param name="cfNonPref" value="0"/>
<param name="cfChangeDir" value="6"/>
<param name="cfExtdStep" value="0"/>
<param name="cfBonusStep" value="2"/>
<param name="cfMalusStep" value="2"/>
<param name="cfPadImpact" value="2"/>
<param name="cfSmdImpact" value="2"/>
<param name="cfHugging" value="0"/>
</pass>
<pass name="Optimize3" refer="Optimize2" active="yes">
<param name="cfChangeDir" value="8"/>
<param name="cfPadImpact" value="0"/>
<param name="cfSmdImpact" value="0"/>
</pass>
<pass name="Optimize4" refer="Optimize3" active="yes">
<param name="cfChangeDir" value="25"/>
</pass>
</autorouter>
<elements>
<element name="U1" library="ESP-WROOM-32" package="MODULE_ESP-WROOM-32" value="ESP-WROOM-32" x="0" y="0.3" smashed="yes">
<attribute name="AVAILABILITY" value="Good" x="0" y="0.3" size="1.778" layer="27" display="off"/>
<attribute name="DESCRIPTION" value=" Module: combo; GPIO, I2C x2, I2S x2, SDIO, SPI x3, UART x3; 19.5dBm " x="0" y="0.3" size="1.778" layer="27" display="off"/>
<attribute name="MF" value="Espressif Systems" x="0" y="0.3" size="1.778" layer="27" display="off"/>
<attribute name="MP" value="ESP-WROOM-32" x="0" y="0.3" size="1.778" layer="27" display="off"/>
<attribute name="NAME" x="-9.01326875" y="16.5739" size="1.67886875" layer="25"/>
<attribute name="PACKAGE" value="Module Espressif Systems" x="0" y="0.3" size="1.778" layer="27" display="off"/>
<attribute name="PRICE" value="5.02 USD" x="0" y="0.3" size="1.778" layer="27" display="off"/>
<attribute name="VALUE" x="-9.02085" y="-12.229" size="1.680290625" layer="27"/>
</element>
</elements>
<signals>
<signal name="GND">
<contactref element="U1" pad="1.1"/>
<contactref element="U1" pad="1"/>
<contactref element="U1" pad="15"/>
<contactref element="U1" pad="38"/>
<wire x1="0.7" y1="1.145" x2="-5.715" y2="-9.455" width="0" layer="19" extent="1-1"/>
<wire x1="9" y1="8.555" x2="0.7" y2="1.145" width="0" layer="19" extent="1-1"/>
<wire x1="-9" y1="8.555" x2="0.7" y2="1.145" width="0" layer="19" extent="1-1"/>
</signal>
<signal name="3V3">
<contactref element="U1" pad="2"/>
</signal>
</signals>
<mfgpreviewcolors>
<mfgpreviewcolor name="soldermaskcolor" color="0xC8008000"/>
<mfgpreviewcolor name="silkscreencolor" color="0xFFFEFEFE"/>
<mfgpreviewcolor name="backgroundcolor" color="0xFF282828"/>
<mfgpreviewcolor name="coppercolor" color="0xFFFFBF00"/>
<mfgpreviewcolor name="substratecolor" color="0xFF786E46"/>
</mfgpreviewcolors>
</board>
</drawing>
</eagle>
