<svg width="9" height="12" viewBox="0 0 9 12" fill="none" xmlns="http://www.w3.org/2000/svg">
  <path d="M5.625 7.5C7.48617 7.5 9 5.98617 9 4.125C9 2.26383 7.48594 0.75 5.625 0.75H2.25C1.83586 0.75 1.5 1.08586 1.5 1.5V6H0.75C0.335859 6 0 6.33516 0 6.75C0 7.16484 0.335859 7.5 0.75 7.5H1.5V8.25H0.75C0.335859 8.25 0 8.58586 0 9C0 9.41414 0.335859 9.75 0.75 9.75H1.5V10.5C1.5 10.9141 1.83586 11.25 2.25 11.25C2.66414 11.25 3 10.9141 3 10.5V9.75H6.75C7.16414 9.75 7.5 9.41414 7.5 9C7.5 8.58586 7.16414 8.25 6.75 8.25H3V7.5H5.625ZM3 2.25H5.625C6.65859 2.25 7.5 3.09141 7.5 4.125C7.5 5.15859 6.65859 6 5.625 6H3V2.25Z" fill="white"/>
</svg>
