<svg width="30" height="30" viewBox="0 0 30 30" fill="none" xmlns="http://www.w3.org/2000/svg">
  <path d="M11.25 7.5H8.75C8.41848 7.5 8.10054 7.6317 7.86612 7.86612C7.6317 8.10054 7.5 8.41848 7.5 8.75V11.25" stroke="#4A59E9" stroke-linecap="round" stroke-linejoin="round"/>
  <path d="M18.75 7.5H21.25C21.5815 7.5 21.8995 7.6317 22.1339 7.86612C22.3683 8.10054 22.5 8.41848 22.5 8.75V11.25" stroke="#4A59E9" stroke-linecap="round" stroke-linejoin="round"/>
  <path d="M22.5 18.75V21.25C22.5 21.5815 22.3683 21.8995 22.1339 22.1339C21.8995 22.3683 21.5815 22.5 21.25 22.5H18.75" stroke="#4A59E9" stroke-linecap="round" stroke-linejoin="round"/>
  <path d="M11.25 22.5H8.75C8.41848 22.5 8.10054 22.3683 7.86612 22.1339C7.6317 21.8995 7.5 21.5815 7.5 21.25V18.75" stroke="#4A59E9" stroke-linecap="round" stroke-linejoin="round"/>
  <path d="M7.5 15H22.5" stroke="#4A59E9" stroke-linecap="round" stroke-linejoin="round"/>
</svg>
