<svg width="375" height="711" viewBox="0 0 375 711" fill="none" xmlns="http://www.w3.org/2000/svg">
  <g filter="url(#filter0_f_102_68)">
    <ellipse cx="352" cy="126.5" rx="71" ry="70.5" fill="#4A59E9"/>
  </g>
  <g filter="url(#filter1_f_102_68)">
    <ellipse cx="352" cy="592.5" rx="71" ry="70.5" fill="#4A59E9"/>
  </g>
  <g filter="url(#filter2_f_102_68)">
    <circle cx="41.5" cy="359.5" r="67.5" fill="#4A59E9"/>
  </g>
  <defs>
    <filter id="filter0_f_102_68" x="-24" y="-249" width="752" height="751" filterUnits="userSpaceOnUse" color-interpolation-filters="sRGB">
      <feFlood flood-opacity="0" result="BackgroundImageFix"/>
      <feBlend mode="normal" in="SourceGraphic" in2="BackgroundImageFix" result="shape"/>
      <feGaussianBlur stdDeviation="152.5" result="effect1_foregroundBlur_102_68"/>
    </filter>
    <filter id="filter1_f_102_68" x="-24" y="217" width="752" height="751" filterUnits="userSpaceOnUse" color-interpolation-filters="sRGB">
      <feFlood flood-opacity="0" result="BackgroundImageFix"/>
      <feBlend mode="normal" in="SourceGraphic" in2="BackgroundImageFix" result="shape"/>
      <feGaussianBlur stdDeviation="152.5" result="effect1_foregroundBlur_102_68"/>
    </filter>
    <filter id="filter2_f_102_68" x="-331" y="-13" width="745" height="745" filterUnits="userSpaceOnUse" color-interpolation-filters="sRGB">
      <feFlood flood-opacity="0" result="BackgroundImageFix"/>
      <feBlend mode="normal" in="SourceGraphic" in2="BackgroundImageFix" result="shape"/>
      <feGaussianBlur stdDeviation="152.5" result="effect1_foregroundBlur_102_68"/>
    </filter>
  </defs>
</svg>
