<svg width="25" height="26" viewBox="0 0 25 26" fill="none" xmlns="http://www.w3.org/2000/svg">
  <path d="M6.25 15.4147C5.83579 15.4147 5.5 15.7505 5.5 16.1647C5.5 16.5789 5.83579 16.9147 6.25 16.9147V15.4147ZM9.89583 16.9147C10.31 16.9147 10.6458 16.5789 10.6458 16.1647C10.6458 15.7505 10.31 15.4147 9.89583 15.4147V16.9147ZM5.20833 7.53967H19.7917V6.03967H5.20833V7.53967ZM21.125 8.87301V17.2063H22.625V8.87301H21.125ZM19.7917 18.5397H5.20833V20.0397H19.7917V18.5397ZM3.875 17.2063V8.87301H2.375V17.2063H3.875ZM5.20833 18.5397C4.47195 18.5397 3.875 17.9427 3.875 17.2063H2.375C2.375 18.7711 3.64353 20.0397 5.20833 20.0397V18.5397ZM21.125 17.2063C21.125 17.9427 20.528 18.5397 19.7917 18.5397V20.0397C21.3565 20.0397 22.625 18.7711 22.625 17.2063H21.125ZM19.7917 7.53967C20.528 7.53967 21.125 8.13663 21.125 8.87301H22.625C22.625 7.3082 21.3565 6.03967 19.7917 6.03967V7.53967ZM5.20833 6.03967C3.64353 6.03967 2.375 7.3082 2.375 8.87301H3.875C3.875 8.13663 4.47195 7.53967 5.20833 7.53967V6.03967ZM3.125 11.7063H21.875V10.2063H3.125V11.7063ZM6.25 16.9147H9.89583V15.4147H6.25V16.9147Z" fill="white"/>
</svg>
