<?xml version="1.0" encoding="UTF-8" standalone="no"?>
<svg
   xmlns:dc="http://purl.org/dc/elements/1.1/"
   xmlns:cc="http://creativecommons.org/ns#"
   xmlns:rdf="http://www.w3.org/1999/02/22-rdf-syntax-ns#"
   xmlns:svg="http://www.w3.org/2000/svg"
   xmlns="http://www.w3.org/2000/svg"
   style="enable-background:new"
   id="svg5009"
   version="1.1"
   viewBox="0 0 4.2333334 4.2333334"
   height="16"
   width="16">
  <defs
     id="defs5003">
    <filter
       id="filter5259"
       style="color-interpolation-filters:sRGB">
      <feBlend
         id="feBlend5261"
         in2="BackgroundImage"
         mode="darken" />
    </filter>
  </defs>
  <metadata
     id="metadata5006">
    <rdf:RDF>
      <cc:Work
         rdf:about="">
        <dc:format>image/svg+xml</dc:format>
        <dc:type
           rdf:resource="http://purl.org/dc/dcmitype/StillImage" />
        <dc:title></dc:title>
      </cc:Work>
    </rdf:RDF>
  </metadata>
  <g
     style="opacity:1;filter:url(#filter5259)"
     transform="translate(0,-292.76667)"
     id="layer1">
    <path
       id="path35"
       style="fill:#ffffff;fill-rule:evenodd;stroke-width:0.14572416"
       d="m -8.0077419,337.79156 v -0.77823 c 0,-0.41203 -0.079281,-0.57223 -0.3013035,-0.57223 h -4.0282696 c -0.808855,0 -1.205334,-0.59515 -1.205334,-2.4721 v -11.92547 c 0,-0.25175 -0.09517,-0.38911 -0.333037,-0.38911 -0.253758,0 -0.523369,0.0687 -0.745416,0.1831 v 12.29172 c 0,2.72386 0.745416,3.66232 2.17275,3.66232 z m 5.5825087,-1.05291 c -1.633519,0 -3.060862,-1.57938 -3.235317,-4.41772 h 5.18602096 c 0.507502,0 0.745402,-0.18312 0.935719,-0.84691 0.126867,-0.48066 0.206161,-1.09865 0.206161,-1.67094 0,-2.60937 -1.363908,-4.50922 -3.33045096,-4.50922 -2.15691,0 -4.060027,2.42628 -4.060027,6.31753 0,3.82256 1.77624,6.45485 4.15516,6.45485 1.443203,0 2.42650696,-0.8469 2.42650696,-1.37339 0,-0.206 -0.06344,-0.50355 -0.158605,-0.68666 -0.618506,0.50354 -1.39561496,0.73246 -2.12516796,0.73246 z m -0.301307,-10.11722 c 1.427335,0 2.36303496,1.28183 2.36303496,3.22746 0,0.43492 -0.06344,0.8469 -0.158588,1.16735 H -5.6605502 c 0.126867,-2.70094 1.443225,-4.39481 2.93401,-4.39481 z m 9.277726,-1.32757 c -2.394764,0 -4.186853,2.99853 -4.186853,6.88976 0,3.68521 1.538335,5.88262 3.600061,5.88262 1.443234,0 2.569238,-1.07584 3.140179,-2.54072 0.01586,1.57938 0.586796,2.42628 1.2370282,2.42628 0.459918,0 0.761259,-0.36624 0.761259,-0.68672 0,-0.20599 -0.03172,-0.38911 -0.06344,-0.54934 h -0.285487 c -0.380624,0 -0.602649,-0.32045 -0.602649,-1.28179 v -13.89397 c 0,-0.32043 -0.111023,-0.45781 -0.3806252,-0.45781 h -0.666084 v 5.53926 c -0.666089,-0.89265 -1.57007,-1.32757 -2.553389,-1.32757 z m -0.396475,11.46767 c -1.617651,0 -2.727816,-1.67094 -2.727816,-4.60079 0,-3.13588 1.379762,-5.53931 3.235318,-5.53931 0.888135,0 1.744542,0.48072 2.44236,1.48783 v 5.19596 c -0.634382,2.31184 -1.792128,3.45631 -2.949862,3.45631 z m 7.0574262,-1.16738 c 0,1.62519 0.491657,2.35765 1.1736,2.35765 0.523355,0 0.8247,-0.36624 0.8247,-0.68672 0,-0.20599 -0.03178,-0.38911 -0.06344,-0.54934 h -0.285463 c -0.380626,0 -0.602673,-0.32045 -0.602673,-1.28179 v -9.59075 c 0,-0.2518 -0.09514,-0.3891 -0.333051,-0.3891 -0.222015,0 -0.475772,0.0687 -0.713672,0.16023 z m 0.523364,-12.65792 c 0.380625,0 0.650236,-0.36622 0.650236,-0.96133 0,-0.64093 -0.317198,-1.05297 -0.681943,-1.05297 -0.36478,0 -0.650231,0.38918 -0.650231,0.9614 0,0.64092 0.333037,1.0529 0.681938,1.0529 z m 10.625795,3.0901 c 0,-0.32043 -0.09519,-0.45779 -0.380639,-0.45779 h -0.650232 v 7.16443 c 0,2.51787 -1.126004,4.02856 -2.52164,4.02856 -1.395652,0 -2.521646,-1.53358 -2.521646,-4.02856 v -6.88977 c 0,-0.2518 -0.111038,-0.3891 -0.333048,-0.3891 -0.237903,0 -0.491647,0.0687 -0.713676,0.16023 v 7.02708 c 0,3.36478 1.490789,5.42483 3.56837,5.42483 2.061725,0 3.552511,-2.06005 3.552511,-5.42483 z m 7.295329,2.40341 c 0.206158,-0.0458 0.459915,-0.16023 0.666086,-0.32048 0.158573,-0.13733 0.222014,-0.25175 0.222014,-0.43487 0,-0.11449 -0.03173,-0.25179 -0.0793,-0.36623 -0.507502,-1.21316 -1.554212,-2.0143 -2.870532,-2.0143 -1.712836,0 -2.870574,1.39625 -2.870574,3.38763 0,1.94562 0.903979,3.1817 2.934009,3.86838 1.459043,0.50354 1.950705,1.21313 1.950705,2.28892 0,1.28184 -0.729526,1.92274 -2.109325,1.92274 -0.888103,0 -1.696945,-0.32043 -2.363034,-0.80114 -0.09517,0.16024 -0.158611,0.45778 -0.158611,0.70958 0,0.54937 1.173591,1.39627 2.632681,1.39627 1.966544,0 3.044998,-1.28182 3.044998,-3.319 0,-1.78538 -0.792965,-2.8383 -2.648523,-3.52497 -1.601808,-0.59516 -2.236153,-1.25894 -2.236153,-2.49498 0,-1.2589 0.761222,-2.10586 1.792078,-2.10586 0.935723,0 1.744543,0.64093 2.093474,1.80831 z" />
    <path
       id="path37"
       style="fill:#ffffff;fill-rule:evenodd;stroke-width:0.26458332"
       d="m -28.00774,344.3665 h 0.0979 v -0.1356 h -0.0979 c -0.61021,0 -0.96428,0.36158 -0.96428,1.09231 v 0.50475 h -0.54988 v 0.14311 h 0.54988 v 3.77415 h 0.14317 v -3.77415 h 0.85876 v -0.14311 h -0.85876 v -0.50475 c 0,-0.64786 0.30128,-0.95671 0.82111,-0.95671 z m 2.69729,0.693 c 0.11295,0 0.18841,-0.0753 0.18841,-0.1883 0,-0.11295 -0.0755,-0.18833 -0.18841,-0.18833 -0.113,0 -0.1883,0.0754 -0.1883,0.18833 0,0.113 0.0753,0.1883 0.1883,0.1883 z m -0.0754,4.68572 h 0.14316 v -3.91726 h -0.14316 z m 4.34721,-3.99264 c -0.48967,0 -0.91155,0.31644 -1.12245,0.8211 v -0.74572 h -0.14319 v 3.91726 h 0.14319 v -2.41067 c 0,-0.85874 0.47459,-1.44638 1.10737,-1.44638 0.52734,0 0.83618,0.43696 0.83618,1.29572 v 2.56133 h 0.14309 v -2.56133 c 0,-0.94162 -0.36158,-1.43131 -0.96419,-1.43131 z m 4.91955,0 c -0.67042,0 -1.06973,0.42939 -1.10738,0.98687 h 0.14311 c 0.008,-0.47461 0.38423,-0.85128 0.96427,-0.85128 0.58005,0 0.90398,0.36915 0.90398,1.01701 v 0.61021 h -0.85125 c -0.82862,0 -1.2882,0.41428 -1.2882,1.12995 0,0.7383 0.41437,1.17518 1.05466,1.17518 0.57253,0 0.91911,-0.2335 1.08479,-0.59513 v 0.51983 h 0.14316 v -2.84004 c 0,-0.73073 -0.37663,-1.1526 -1.04714,-1.1526 z m -0.17325,3.93234 c -0.55747,0 -0.91905,-0.39174 -0.91905,-1.03958 0,-0.62521 0.39923,-0.99435 1.14503,-0.99435 h 0.85125 v 0.90397 c 0,0.72322 -0.3465,1.12996 -1.07723,1.12996 z m 5.42439,-3.93234 c -0.48969,0 -0.91157,0.31644 -1.12247,0.8211 v -0.74572 h -0.14317 v 3.91726 h 0.14317 v -2.41067 c 0,-0.85874 0.47461,-1.44638 1.10738,-1.44638 0.52732,0 0.83617,0.43696 0.83617,1.29572 v 2.56133 h 0.1431104 v -2.56133 c 0,-0.94162 -0.3615804,-1.43131 -0.9641904,-1.43131 z m 4.8818804,4.06794 c 0.71567,0 1.14503,-0.49718 1.14503,-1.29572 h -0.14311 c 0,0.71565 -0.37663,1.16012 -1.00192,1.16012 -0.6177,0 -0.98685,-0.44447 -0.98685,-1.08474 v -1.62719 c 0,-0.64037 0.36158,-1.08482 0.96428,-1.08482 0.62521,0 0.99435,0.44445 0.99435,1.13753 h 0.14309 c 0,-0.77595 -0.4218,-1.27312 -1.13744,-1.27312 -0.69308,0 -1.10744,0.49717 -1.10744,1.22041 v 1.62719 c 0,0.72316 0.42188,1.22034 1.13001,1.22034 z m 5.9969404,-1.22034 c -0.0753,0.64027 -0.39931,1.08474 -1.05466,1.08474 -0.6177,0 -0.98684,-0.44447 -0.98684,-1.08474 v -0.73073 h 2.1168 v -0.89646 c 0,-0.72324 -0.4294,-1.22041 -1.12996,-1.22041 -0.70816,0 -1.13004,0.49717 -1.13004,1.22041 v 1.62719 c 0,0.72316 0.42188,1.22034 1.13004,1.22034 0.74581,0 1.12244,-0.49718 1.19774,-1.22034 z m -1.05466,-2.71201 c 0.61021,0 0.98684,0.44445 0.98684,1.08482 v 0.76087 h -1.97368 v -0.76087 c 0,-0.64037 0.36914,-1.08482 0.98684,-1.08482 z m 9.296399,3.85705 c -0.2109,-0.30136 -0.42937,-0.60264 -0.64026,-0.89649 0.17324,-0.31634 0.31633,-0.693 0.41428,-1.11487 l -0.1356,-0.0452 c -0.0829,0.39171 -0.2109,0.73821 -0.36907,1.03206 -0.4596,-0.63278 -0.90405,-1.25055 -1.25055,-1.79295 0.5424,-0.44445 1.09231,-0.88138 1.09231,-1.52167 0,-0.61018 -0.39175,-1.01701 -0.97928,-1.01701 -0.63286,0 -0.96427,0.43696 -0.95679,1.02452 0,0.34658 0.25615,0.86633 0.64035,1.4841 -0.5348,0.44445 -1.06214,0.92655 -1.06214,1.64219 0,0.77595 0.50466,1.28821 1.26555,1.28821 0.46702,0 0.90398,-0.30885 1.24299,-0.82868 0.18081,0.24104 0.36155,0.49718 0.53488,0.74581 z m -2.67428,-4.33163 c -0.007,-0.50469 0.26371,-0.8814 0.80611,-0.8814 0.50467,0 0.83616,0.34657 0.83616,0.85881 0,0.57255 -0.50474,0.97935 -1.03206,1.40874 -0.36914,-0.58007 -0.61021,-1.06973 -0.61021,-1.38615 z m 0.678,4.26381 c -0.66291,0 -1.09987,-0.45952 -1.09987,-1.14501 0,-0.64037 0.48217,-1.08481 0.99443,-1.50669 0.35407,0.55747 0.80603,1.19025 1.28061,1.85319 -0.31633,0.49715 -0.73072,0.79851 -1.17517,0.79851 z m 8.7315102,-1.07722 c -0.0753,0.64027 -0.39931,1.08474 -1.05465,1.08474 -0.6177,0 -0.98684,-0.44447 -0.98684,-1.08474 v -0.73073 h 2.11679 v -0.89646 c 0,-0.72324 -0.42939,-1.22041 -1.12995,-1.22041 -0.70816,0 -1.13004,0.49717 -1.13004,1.22041 v 1.62719 c 0,0.72316 0.42188,1.22034 1.13004,1.22034 0.74581,0 1.12244,-0.49718 1.19774,-1.22034 z m -1.05465,-2.71201 c 0.61021,0 0.98684,0.44445 0.98684,1.08482 v 0.76087 h -1.97368 v -0.76087 c 0,-0.64037 0.36914,-1.08482 0.98684,-1.08482 z m 6.02707,-1.58197 v 2.19218 c -0.15816,-0.48209 -0.56499,-0.7458 -1.06973,-0.7458 -0.6177,0 -1.06223,0.51226 -1.06223,1.20533 v 1.65735 c 0,0.70057 0.4897,1.20526 1.13004,1.20526 0.43693,0 0.82111,-0.24855 1.00192,-0.57248 v 0.49718 h 0.14309 v -5.43902 z m -0.99443,5.37872 c -0.5574,0 -0.99433,-0.43688 -0.99433,-1.06966 v -1.65735 c 0,-0.63278 0.39171,-1.06974 0.95668,-1.06974 0.54991,0 1.03208,0.4144 1.03208,1.29572 v 1.50667 c 0,0.54989 -0.43696,0.99436 -0.99443,0.99436 z m 6.10989,-3.85696 v 2.41056 c 0,0.85884 -0.47461,1.4464 -1.10739,1.4464 -0.52731,0 -0.83616,-0.43688 -0.83616,-1.29572 v -2.56124 h -0.14319 v 2.56124 c 0,0.94171 0.36158,1.43132 0.96427,1.43132 0.48969,0 0.91149,-0.31636 1.12247,-0.82111 v 0.74581 h 0.14308 v -3.91726 z m 4.1135,3.99256 c 0.71567,0 1.14504,-0.49718 1.14504,-1.29572 h -0.14309 c 0,0.71565 -0.37666,1.16012 -1.00195,1.16012 -0.61769,0 -0.98684,-0.44447 -0.98684,-1.08474 v -1.62719 c 0,-0.64037 0.36158,-1.08482 0.96427,-1.08482 0.62521,0 0.99436,0.44445 0.99436,1.13753 h 0.14309 c 0,-0.77595 -0.4218,-1.27312 -1.13745,-1.27312 -0.69307,0 -1.10744,0.49717 -1.10744,1.22041 v 1.62719 c 0,0.72316 0.42188,1.22034 1.13001,1.22034 z m 4.97986,-4.06794 c -0.67043,0 -1.06971,0.42939 -1.10736,0.98687 h 0.14308 c 0.008,-0.47461 0.38423,-0.85128 0.96428,-0.85128 0.58004,0 0.90397,0.36915 0.90397,1.01701 v 0.61021 h -0.85124 c -0.8286,0 -1.2882,0.41428 -1.2882,1.12995 0,0.7383 0.41439,1.17518 1.05465,1.17518 0.57256,0 0.91914,-0.2335 1.08479,-0.59513 v 0.51983 h 0.14319 v -2.84004 c 0,-0.73073 -0.37666,-1.1526 -1.04716,-1.1526 z m -0.17325,3.93234 c -0.55748,0 -0.91903,-0.39174 -0.91903,-1.03958 0,-0.62521 0.3992,-0.99435 1.14501,-0.99435 h 0.85124 v 0.90397 c 0,0.72322 -0.3465,1.12996 -1.07722,1.12996 z m 5.29635,-0.0603 c -0.53483,0 -0.82868,-0.24103 -0.82868,-0.82867 v -2.83245 h 0.91906 v -0.13559 H 38.4635 v -0.92663 h -0.14308 v 0.92663 h -0.54248 v 0.13559 h 0.54248 v 2.83245 c 0,0.66294 0.32393,0.96427 0.97176,0.96427 h 0.1356 v -0.1356 z m 2.81792,-4.56517 c 0.11295,0 0.1883,-0.0753 0.1883,-0.1883 0,-0.11295 -0.0754,-0.18833 -0.1883,-0.18833 -0.11303,0 -0.18833,0.0754 -0.18833,0.18833 0,0.113 0.0753,0.1883 0.18833,0.1883 z m -0.0754,4.68572 h 0.14316 v -3.91726 H 42.0347 Z m 4.13617,0.0753 c 0.72322,0 1.15258,-0.49718 1.15258,-1.22034 v -1.62719 c 0,-0.72324 -0.42936,-1.22041 -1.15258,-1.22041 -0.72315,0 -1.1526,0.49717 -1.1526,1.22041 v 1.62719 c 0,0.72316 0.42945,1.22034 1.1526,1.22034 z m 0,-0.1356 c -0.63277,0 -1.00943,-0.44447 -1.00943,-1.08474 v -1.62719 c 0,-0.64037 0.37666,-1.08482 1.00943,-1.08482 0.63278,0 1.0095,0.44445 1.0095,1.08482 v 1.62719 c 0,0.64027 -0.37672,1.08474 -1.0095,1.08474 z m 5.25862,-3.93234 c -0.48969,0 -0.91154,0.31644 -1.12244,0.8211 v -0.74572 h -0.14319 v 3.91726 h 0.14319 v -2.41067 c 0,-0.85874 0.47459,-1.44638 1.10736,-1.44638 0.52732,0 0.83619,0.43696 0.83619,1.29572 v 2.56133 h 0.14309 v -2.56133 c 0,-0.94162 -0.36158,-1.43131 -0.9642,-1.43131 z" />
    <path
       id="path39"
       style="fill:#ffffff;fill-rule:evenodd;stroke:#ffffff;stroke-width:0.17004772;stroke-linecap:butt;stroke-linejoin:miter;stroke-dasharray:none"
       d="m -32.29971,347.45676 h -7.82368" />
    <path
       id="path41"
       style="fill:#ffffff;fill-rule:evenodd;stroke:#ffffff;stroke-width:0.17004772;stroke-linecap:butt;stroke-linejoin:miter;stroke-dasharray:none"
       d="m 63.00024,347.45676 h -7.8237" />
    <path
       id="path43"
       style="fill:#ffffff;fill-rule:evenodd;stroke-width:0.03055406"
       d="m 3.7717351,296.75834 v -0.18654 c 0,-0.0988 -0.041411,-0.13719 -0.1574713,-0.13719 H 1.5089767 c -0.422746,0 -0.62998741,-0.14265 -0.62998741,-0.59255 v -2.85859 c 0,-0.0604 -0.0497717,-0.0932 -0.17409782,-0.0932 -0.13258759,0 -0.27343854,0.0164 -0.38950317,0.044 v 2.94636 c 0,0.6529 0.38950317,0.87786 1.1355606,0.87786 z" />
    <path
       id="path45"
       style="fill:#ffffff;fill-rule:evenodd;stroke-width:0.03055406"
       d="m 1.9145281,296.21698 v -0.78774 c 0,-0.0603 -0.049766,-0.0932 -0.1740946,-0.0932 -0.1325907,0 -0.273442,0.0164 -0.389507,0.0439 v 0.83709 z" />
    <path
       id="path47"
       style="fill:#ffffff;fill-rule:evenodd;stroke-width:0.03055406"
       d="m 2.8431311,296.21698 v -1.36268 c 0,-0.0604 -0.049766,-0.0932 -0.1740914,-0.0932 -0.1325907,0 -0.2734419,0.0164 -0.389507,0.0438 v 1.41203 z" />
    <path
       id="path49"
       style="fill:#ffffff;fill-rule:evenodd;stroke-width:0.03055406"
       d="m 3.7717351,296.21698 v -2.02882 c 0,-0.0603 -0.049765,-0.0932 -0.174091,-0.0932 -0.1325907,0 -0.2734421,0.0164 -0.3895072,0.0439 v 2.07818 z" />
  </g>
</svg>
