<svg class="svg-wrap active" xmlns="http://www.w3.org/2000/svg" xmlns:xlink="http://www.w3.org/1999/xlink" x="0px" y="0px"
	 viewBox="74.4 197.7 446.5 446.5" enable-background="new 74.4 197.7 446.5 446.5" xml:space="preserve">
<path class="svg-path-checkbox border_active"  d="M74.4,644.2h446.5V197.7H74.4 M256,546.8L147.4,438.2l35.3-34.7l73.2,73l170.4-170.4l34.3,35.9L256,546.8z"/>
</svg>
