<?xml version="1.0" encoding="UTF-8"?>
<svg width="12px" height="13px" viewBox="0 0 12 13" version="1.1" xmlns="http://www.w3.org/2000/svg" xmlns:xlink="http://www.w3.org/1999/xlink">
    <!-- Generator: Sketch 47.1 (45422) - http://www.bohemiancoding.com/sketch -->
    <title>Main Tab/White/P.Details</title>
    <desc>Created with Sketch.</desc>
    <defs></defs>
    <g id="Symbols" stroke="none" stroke-width="1" fill="none" fill-rule="evenodd">
        <g id="Main-Tab/White/P.Details" fill-rule="nonzero" fill="#FFFFFF">
            <path d="M10.2923663,11.946499 L0.846297286,11.946499 C0.568471727,11.946499 0.383254688,11.761282 0.290646168,11.576065 C-0.0797879108,10.8351968 -0.0797879108,10.0017201 0.198037648,9.26085197 C0.568471727,8.42737529 1.30933988,7.77911565 2.23542508,7.59389862 C2.42064212,7.40868158 2.7910762,7.31607306 3.06890176,7.31607306 C3.43933584,7.22346454 3.7171614,7.13085602 4.08759548,7.0382475 C4.08759548,7.0382475 4.08759548,6.94563898 4.08759548,6.94563898 C3.7171614,6.48259638 3.43933584,6.01955378 3.34672732,5.55651118 C3.16151028,5.37129414 3.06890176,5.09346858 2.97629324,4.81564302 C2.97629324,4.7230345 2.97629324,4.63042598 2.88368472,4.63042598 C2.7910762,4.25999191 2.7910762,3.79694931 2.88368472,3.42651523 C2.69846768,2.77825559 2.69846768,2.12999595 2.97629324,1.57434483 C3.43933584,0.648259638 4.45802955,0 5.47672327,0 L5.66194031,0 C6.77324255,0 7.79193626,0.648259638 8.25497886,1.57434483 C8.4401959,2.12999595 8.4401959,2.87086411 8.25497886,3.42651523 C8.34758738,3.79694931 8.34758738,4.16738339 8.25497886,4.63042598 C8.25497886,4.63042598 8.25497886,4.7230345 8.25497886,4.81564302 C8.25497886,5.09346858 8.06976182,5.37129414 7.88454478,5.55651118 C7.69932774,6.01955378 7.42150218,6.48259638 7.05106811,6.76042194 C7.05106811,6.85303046 7.14367663,6.85303046 7.14367663,6.94563898 C7.5141107,7.13085602 7.79193626,7.22346454 8.16237034,7.31607306 C8.4401959,7.31607306 8.62541294,7.40868158 8.9032385,7.5012901 C11.31106,8.51998381 11.0332345,10.1869372 10.9406259,11.1130224 C10.9406259,11.2056309 10.9406259,11.2982394 10.9406259,11.3908479 C10.8480174,11.6686735 10.6628004,11.946499 10.2923663,11.946499 Z" id="Shape"></path>
        </g>
    </g>
</svg>