<?xml version="1.0" encoding="UTF-8"?>
<svg width="25px" height="23px" viewBox="0 0 25 23" version="1.1" xmlns="http://www.w3.org/2000/svg" xmlns:xlink="http://www.w3.org/1999/xlink">
    <!-- Generator: Sketch 47.1 (45422) - http://www.bohemiancoding.com/sketch -->
    <title>Title/New Equipment</title>
    <desc>Created with Sketch.</desc>
    <defs></defs>
    <g id="Symbols" stroke="none" stroke-width="1" fill="none" fill-rule="evenodd">
        <g id="Title/New-Equipment" fill-rule="nonzero" fill="#5977B7">
            <g id="New-Equipment" transform="translate(0.000000, 1.000000)">
                <path d="M20.9,17.4 L2.6,17.4 C1.1,17.4 0,16.2 0,14.8 L0,14.8 L0,2.6 C0,1.2 1.2,0 2.6,0 L2.6,0 L20.8,0 C22.3,0 23.4,1.2 23.4,2.6 L23.4,2.6 L23.4,14.7 C23.5,16.2 22.3,17.4 20.9,17.4 L20.9,17.4 Z M2.6,1.5 C2,1.5 1.5,2 1.5,2.6 L1.5,2.6 L1.5,14.7 C1.5,15.3 2,15.8 2.6,15.8 C2.6,15.8 2.6,15.8 2.6,15.8 L20.8,15.8 C21.4,15.8 21.9,15.3 21.9,14.7 L21.9,14.7 L21.9,2.6 C21.9,2 21.4,1.5 20.8,1.5 L20.8,1.5 L2.6,1.5 L2.6,1.5 Z" id="Shape"></path>
                <path d="M15.4,9.5 L8.1,9.5 C7.7,9.5 7.3,9.2 7.3,8.7 C7.3,8.2 7.7,8 8.1,8 L15.4,8 C15.8,8 16.2,8.3 16.2,8.7 C16.2,9.2 15.8,9.5 15.4,9.5 Z" id="Shape"></path>
                <path d="M11.8,13.2 C11.4,13.2 11,12.9 11,12.4 L11,5.1 C11,4.7 11.3,4.3 11.8,4.3 C12.3,4.3 12.6,4.6 12.6,5.1 L12.6,12.4 C12.5,12.8 12.2,13.2 11.8,13.2 Z" id="Shape"></path>
                <path d="M16.2,21.5 L7.3,21.5 C6.9,21.5 6.5,21.2 6.5,20.7 C6.5,20.2 6.9,20 7.3,20 L16.2,20 C16.6,20 17,20.3 17,20.8 C17,21.3 16.6,21.5 16.2,21.5 Z" id="Shape"></path>
                <path d="M9.8,21.2 C9.4,21.2 9,20.9 9,20.4 L9,17.3 C9,16.9 9.3,16.5 9.8,16.5 C10.3,16.5 10.6,16.8 10.6,17.3 L10.6,20.4 C10.5,20.9 10.2,21.2 9.8,21.2 Z" id="Shape"></path>
                <path d="M13.8,21.2 C13.4,21.2 13,20.9 13,20.4 L13,17.3 C13,16.9 13.3,16.5 13.8,16.5 C14.3,16.5 14.6,16.8 14.6,17.3 L14.6,20.4 C14.5,20.9 14.2,21.2 13.8,21.2 Z" id="Shape"></path>
            </g>
        </g>
    </g>
</svg>