<?xml version="1.0" encoding="UTF-8"?>
<svg width="26px" height="22px" viewBox="0 0 26 22" version="1.1" xmlns="http://www.w3.org/2000/svg" xmlns:xlink="http://www.w3.org/1999/xlink">
    <!-- Generator: Sketch 47.1 (45422) - http://www.bohemiancoding.com/sketch -->
    <title>Title/New Patient</title>
    <desc>Created with Sketch.</desc>
    <defs></defs>
    <g id="Symbols" stroke="none" stroke-width="1" fill="none" fill-rule="evenodd">
        <g id="Title/New-Patient" fill-rule="nonzero" fill="#507D68">
            <g id="New-Patient" transform="translate(0.000000, 1.000000)">
                <path d="M20.5,16.2 L11,16.2 C10.6,16.2 10.3,15.9 10.3,15.5 C10.3,15.4 10.3,12.7 12.3,11.7 C12.7,11.5 13.1,11.4 13.5,11.3 C13.7,11.3 14,11.2 14.2,11.1 L14.2,11 C13.9,10.6 13.6,10.2 13.5,9.7 C13.3,9.5 13.2,9.2 13.2,9 C13.2,8.9 13.2,8.8 13.1,8.8 C13,8.4 13,8 13.1,7.6 C12.9,7 12.9,6.3 13.1,5.7 C13.6,4.7 14.6,4.1 15.7,4.1 L16,4.1 C17.1,4.1 18.1,4.7 18.6,5.7 C18.8,6.3 18.8,7 18.6,7.6 C18.7,8 18.7,8.4 18.6,8.8 C18.6,8.9 18.6,9 18.5,9 C18.5,9.3 18.3,9.5 18.2,9.8 C18,10.3 17.7,10.7 17.4,11 L17.5,11.1 C17.8,11.2 18.1,11.3 18.4,11.4 C18.7,11.5 19,11.6 19.2,11.7 C20.5,12.5 21.3,14 21.2,15.6 C21.1,15.9 20.9,16.2 20.5,16.2 Z M11.8,14.8 L19.8,14.8 C19.7,14.1 19.3,13.4 18.6,13 C18.4,12.9 18.2,12.9 18,12.8 C17.6,12.7 17.1,12.5 16.7,12.3 C16.2,12 15.8,11.4 15.8,10.7 C15.8,10.4 16,10.1 16.4,10 C16.6,9.8 16.8,9.5 16.9,9.2 C16.9,9 17,8.9 17.1,8.8 L17.1,8.8 C17.1,8.7 17.1,8.6 17.2,8.5 C17.2,8.4 17.2,8.3 17.2,8.2 C17.1,8 17,7.8 17.1,7.5 C17.3,7.1 17.3,6.7 17.2,6.3 C16.9,5.8 16.4,5.6 15.9,5.5 L15.8,5.5 C15.3,5.5 14.8,5.8 14.5,6.3 C14.4,6.7 14.5,7.1 14.6,7.5 C14.7,7.7 14.6,8 14.5,8.2 C14.5,8.3 14.5,8.4 14.5,8.5 C14.5,8.6 14.6,8.7 14.6,8.8 L14.6,8.8 C14.7,8.9 14.8,9.1 14.8,9.2 C14.9,9.5 15,9.8 15.2,10.1 C15.5,10.2 15.7,10.5 15.6,10.8 C15.6,11.4 15.4,12 14.9,12.4 C14.5,12.6 14.1,12.7 13.7,12.8 C13.4,12.8 13.1,12.9 12.9,13 C12.3,13.3 11.9,14 11.8,14.8 L11.8,14.8 Z" id="Shape"></path>
                <path d="M21.8,20.6 L2.8,20.6 C1.3,20.6 0,19.4 0,17.8 L0,17.8 L0,2.7 C0,1.2 1.2,0 2.8,0 C2.8,0 2.8,0 2.8,0 L21.9,0 C23.4,0 24.7,1.2 24.7,2.8 L24.7,2.8 L24.7,17.9 C24.6,19.3 23.4,20.6 21.8,20.6 C21.9,20.6 21.9,20.6 21.8,20.6 Z M2.8,1.5 C2.1,1.5 1.5,2.1 1.5,2.8 L1.5,2.8 L1.5,17.9 C1.5,18.6 2.1,19.2 2.8,19.2 C2.8,19.2 2.8,19.2 2.8,19.2 L21.9,19.2 C22.6,19.2 23.2,18.6 23.2,17.9 L23.2,17.9 L23.2,2.7 C23.2,2 22.6,1.4 21.9,1.4 C21.9,1.4 21.9,1.4 21.9,1.4 L2.8,1.5 L2.8,1.5 Z" id="Shape"></path>
                <path d="M9.2,10.4 L4.2,10.4 C3.8,10.4 3.5,10.1 3.5,9.7 C3.5,9.4 3.9,9 4.2,9 L4.2,9 L9.2,9 C9.6,9 10,9.4 10,9.7 C10,10.1 9.6,10.4 9.2,10.4 Z" id="Shape"></path>
                <path d="M6.8,12.9 C6.4,12.9 6.1,12.6 6.1,12.2 L6.1,7.2 C6.1,6.8 6.4,6.5 6.8,6.5 C7.2,6.5 7.5,6.8 7.5,7.2 L7.5,12.2 C7.4,12.6 7.1,12.9 6.8,12.9 Z" id="Shape"></path>
            </g>
        </g>
    </g>
</svg>