<?xml version="1.0" encoding="UTF-8"?>
<svg width="20px" height="20px" viewBox="0 0 20 20" version="1.1" xmlns="http://www.w3.org/2000/svg" xmlns:xlink="http://www.w3.org/1999/xlink">
    <!-- Generator: Sketch 47.1 (45422) - http://www.bohemiancoding.com/sketch -->
    <title>Light Checkbox/Inactive</title>
    <desc>Created with Sketch.</desc>
    <defs>
        <rect id="path-1" x="0" y="0" width="20" height="20" rx="2"></rect>
    </defs>
    <g id="Symbols" stroke="none" stroke-width="1" fill="none" fill-rule="evenodd">
        <g id="Light-Checkbox/Inactive">
            <g id="Checkbox-Active">
                <g id="Base">
                    <use fill="#EFF2F5" fill-rule="evenodd" xlink:href="#path-1"></use>
                    <rect stroke="#93969C" stroke-width="1" x="0.5" y="0.5" width="19" height="19" rx="2"></rect>
                </g>
            </g>
        </g>
    </g>
</svg>