<?xml version="1.0" encoding="UTF-8"?>
<svg width="26px" height="21px" viewBox="0 0 26 21" version="1.1" xmlns="http://www.w3.org/2000/svg" xmlns:xlink="http://www.w3.org/1999/xlink">
    <!-- Generator: Sketch 47.1 (45422) - http://www.bohemiancoding.com/sketch -->
    <title>Menu</title>
    <desc>Created with Sketch.</desc>
    <defs></defs>
    <g id="Symbols" stroke="none" stroke-width="1" fill="none" fill-rule="evenodd">
        <g id="Menu" fill="#F1F1F1">
            <path d="M0.209302326,1.49917763 C0.209302326,0.947347063 0.653315345,0.5 1.21212334,0.5 L24.7878767,0.5 C25.3417194,0.5 25.7906977,0.939091733 25.7906977,1.49917763 L25.7906977,2.65871711 C25.7906977,3.21054767 25.3466847,3.65789474 24.7878767,3.65789474 L1.21212334,3.65789474 C0.658280587,3.65789474 0.209302326,3.218803 0.209302326,2.65871711 L0.209302326,1.49917763 Z M0.209302326,9.92023026 C0.209302326,9.36839969 0.653315345,8.92105263 1.21212334,8.92105263 L24.7878767,8.92105263 C25.3417194,8.92105263 25.7906977,9.36014436 25.7906977,9.92023026 L25.7906977,11.0797697 C25.7906977,11.6316003 25.3466847,12.0789474 24.7878767,12.0789474 L1.21212334,12.0789474 C0.658280587,12.0789474 0.209302326,11.6398556 0.209302326,11.0797697 L0.209302326,9.92023026 Z M0.209302326,18.3412829 C0.209302326,17.7894523 0.653315345,17.3421053 1.21212334,17.3421053 L24.7878767,17.3421053 C25.3417194,17.3421053 25.7906977,17.781197 25.7906977,18.3412829 L25.7906977,19.5008224 C25.7906977,20.0526529 25.3466847,20.5 24.7878767,20.5 L1.21212334,20.5 C0.658280587,20.5 0.209302326,20.0609083 0.209302326,19.5008224 L0.209302326,18.3412829 Z"></path>
        </g>
    </g>
</svg>