<?xml version="1.0" encoding="UTF-8"?>
<svg width="20px" height="20px" viewBox="0 0 20 20" version="1.1" xmlns="http://www.w3.org/2000/svg" xmlns:xlink="http://www.w3.org/1999/xlink">
    <!-- Generator: Sketch 47.1 (45422) - http://www.bohemiancoding.com/sketch -->
    <title>Light Checkbox/Locked</title>
    <desc>Created with Sketch.</desc>
    <defs></defs>
    <g id="Symbols" stroke="none" stroke-width="1" fill="none" fill-rule="evenodd">
        <g id="Light-Checkbox/Locked">
            <g id="Checkbox-Active">
                <rect id="Base" fill="#B4B4B4" x="0" y="0" width="20" height="20" rx="2"></rect>
                <polygon id="Check" fill="#FFFFFF" points="14.1903896 5 8.40651885 11.2297805 5.77100091 8.52452566 4 10.3685407 8.44596769 15 9.31132405 14.0163504 16 6.80292035"></polygon>
            </g>
        </g>
    </g>
</svg>