<?xml version="1.0" encoding="UTF-8"?>
<svg width="18px" height="18px" viewBox="0 0 18 18" version="1.1" xmlns="http://www.w3.org/2000/svg" xmlns:xlink="http://www.w3.org/1999/xlink">
    <!-- Generator: Sketch 47.1 (45422) - http://www.bohemiancoding.com/sketch -->
    <title>Recycle Bin Red</title>
    <desc>Created with Sketch.</desc>
    <defs></defs>
    <g id="Symbols" stroke="none" stroke-width="1" fill="none" fill-rule="evenodd">
        <g id="Recycle-Bin-Red" fill-rule="nonzero" fill="#BC5A40">
            <g transform="translate(1.000000, 0.000000)" id="Shape">
                <path d="M10.8214286,17.5714286 L3.64285714,17.5714286 C2.57142857,17.5714286 1.60714286,16.7142857 1.60714286,15.6428571 L0.535714286,5.14285714 C0.535714286,4.71428571 0.857142857,4.39285714 1.28571429,4.39285714 C1.60714286,4.39285714 1.92857143,4.60714286 2.03571429,5.03571429 L3,15.6428571 C3,15.9642857 3.21428571,16.1785714 3.53571429,16.1785714 L10.7142857,16.1785714 C11.0357143,16.1785714 11.25,15.9642857 11.25,15.6428571 L12.2142857,5.03571429 C12.2142857,4.60714286 12.6428571,4.28571429 12.9642857,4.39285714 C12.9642857,4.39285714 12.9642857,4.39285714 12.9642857,4.39285714 C13.3928571,4.39285714 13.7142857,4.82142857 13.6071429,5.25 L12.8571429,15.75 C12.75,16.8214286 11.8928571,17.5714286 10.8214286,17.5714286 Z"></path>
                <path d="M8.78571429,14.3571429 C8.35714286,14.3571429 8.03571429,14.0357143 8.03571429,13.6071429 L8.03571429,13.6071429 L8.03571429,8.25 C8.03571429,7.92857143 8.46428571,7.5 8.78571429,7.5 C9.21428571,7.5 9.53571429,7.82142857 9.53571429,8.25 C9.53571429,8.25 9.53571429,8.25 9.53571429,8.25 L9.53571429,13.6071429 C9.53571429,14.0357143 9.21428571,14.3571429 8.78571429,14.3571429 C8.78571429,14.3571429 8.78571429,14.3571429 8.78571429,14.3571429 Z"></path>
                <path d="M5.57142857,14.3571429 C5.14285714,14.3571429 4.82142857,14.0357143 4.82142857,13.6071429 L4.82142857,13.6071429 L4.82142857,8.25 C4.82142857,7.92857143 5.25,7.5 5.57142857,7.5 C6,7.5 6.32142857,7.82142857 6.32142857,8.25 C6.32142857,8.25 6.32142857,8.25 6.32142857,8.25 L6.32142857,13.6071429 C6.32142857,14.0357143 6,14.3571429 5.57142857,14.3571429 C5.57142857,14.3571429 5.57142857,14.3571429 5.57142857,14.3571429 Z"></path>
                <path d="M9.85714286,5.80000019 C9.42857143,5.80000019 9,5.57142857 9,5.14285714 L9,3 C9,2.89285714 8.89285714,2.78571429 8.67857143,2.78571429 L5.46428571,2.78571429 C5.46428571,2.67857143 5.35714286,2.78571429 5.35714286,2.89285714 C5.35714286,2.89285714 5.35714286,3.60714286 5.35714286,5.03571429 C5.35714286,5.46428571 5.03571429,5.78571429 4.5,5.78571429 C3.96428571,5.78571429 3.75,5.57142857 3.75,5.03571429 L3.75,2.89285714 C3.75,1.82142857 4.60714286,1.07142857 5.57142857,0.964285714 C5.57142857,0.964285714 6.64285714,0.964285714 8.78571429,0.964285714 C9.85714286,1.07142857 10.6071429,1.92857143 10.7142857,2.89285714 L10.7142857,5.03571429 C10.7142857,5.57142857 10.2857143,5.80000019 9.85714286,5.80000019 Z"></path>
                <path d="M13.6071429,5.78571429 L0.75,5.78571429 C0.321428571,5.78571429 0,5.46428571 0,5.03571429 C0,4.60714286 0.321428571,4.28571429 0.75,4.28571429 L13.6071429,4.28571429 C14.0357143,4.28571429 14.3571429,4.60714286 14.3571429,5.03571429 C14.3571429,5.46428571 14.0357143,5.78571429 13.6071429,5.78571429 Z"></path>
            </g>
        </g>
    </g>
</svg>