<?xml version="1.0" encoding="UTF-8"?>
<svg width="11px" height="12px" viewBox="0 0 11 12" version="1.1" xmlns="http://www.w3.org/2000/svg" xmlns:xlink="http://www.w3.org/1999/xlink">
    <!-- Generator: Sketch 47.1 (45422) - http://www.bohemiancoding.com/sketch -->
    <title>2Arrows</title>
    <desc>Created with Sketch.</desc>
    <defs></defs>
    <g id="Symbols" stroke="none" stroke-width="1" fill="none" fill-rule="evenodd">
        <g id="2Arrows" fill="#FFFFFF">
            <polygon id="Arrow" transform="translate(3.000000, 6.000000) rotate(-90.000000) translate(-3.000000, -6.000000) " points="3.00056631 3 -2.5 8.39127149 -1.90480848 9 3.00056631 4.1891177 7.90707372 9 8.5 8.39127149"></polygon>
            <polygon id="Arrow" transform="translate(8.000000, 6.000000) rotate(-90.000000) translate(-8.000000, -6.000000) " points="8.00056631 3 2.5 8.39127149 3.09519152 9 8.00056631 4.1891177 12.9070737 9 13.5 8.39127149"></polygon>
        </g>
    </g>
</svg>