<?xml version="1.0" encoding="UTF-8"?>
<svg width="25px" height="25px" viewBox="0 0 25 25" version="1.1" xmlns="http://www.w3.org/2000/svg" xmlns:xlink="http://www.w3.org/1999/xlink">
    <!-- Generator: Sketch 47.1 (45422) - http://www.bohemiancoding.com/sketch -->
    <title>Main Menu/Resources</title>
    <desc>Created with Sketch.</desc>
    <defs></defs>
    <g id="Symbols" stroke="none" stroke-width="1" fill="none" fill-rule="evenodd">
        <g id="Main-Menu/Resources" fill-rule="nonzero" fill="#5D83CC">
            <g id="Resources">
                <path d="M12,1.6 L22.5,6.4 L22.5,18.6 L12,23.3 L1.5,18.6 L1.5,6.4 L12,1.6 L12,1.6 Z M12,0 L0,5.4 L0,19.5 L12,25 L24,19.6 L24,5.4 L12,0 L12,0 Z" id="Shape"></path>
                <path d="M12,11.7 C11.9,11.7 11.8,11.7 11.7,11.6 L0.7,6.6 C0.3,6.4 0.2,6 0.3,5.6 C0.4,5.2 0.9,5.1 1.3,5.2 L1.3,5.2 L12,10.2 L22.7,5.3 C23.1,5.1 23.5,5.3 23.7,5.7 C23.9,6.1 23.7,6.5 23.3,6.7 L23.3,6.7 L12.3,11.7 C12.2,11.7 12.1,11.8 12,11.7 Z" id="Shape"></path>
                <path d="M12,24.7 C11.6,24.7 11.2,24.4 11.2,23.9 L11.2,11 C11.2,10.6 11.5,10.2 12,10.2 C12.5,10.2 12.8,10.5 12.8,11 L12.8,24 C12.8,24.4 12.4,24.7 12,24.7 Z" id="Shape"></path>
            </g>
        </g>
    </g>
</svg>