<?xml version="1.0" encoding="UTF-8"?>
<svg width="25px" height="25px" viewBox="0 0 25 25" version="1.1" xmlns="http://www.w3.org/2000/svg" xmlns:xlink="http://www.w3.org/1999/xlink">
    <!-- Generator: Sketch 47.1 (45422) - http://www.bohemiancoding.com/sketch -->
    <title>Main Tab/Blue/Working Hours</title>
    <desc>Created with Sketch.</desc>
    <defs></defs>
    <g id="Symbols" stroke="none" stroke-width="1">
        <g id="Main-Tab/Blue/Working-Hours" >
            <g id="Working-Hours2" transform="translate(3.000000, 0.000000)">
                <path d="M8.8,20.5 C4,20.5 0,16.6 0,11.8 C0,7 3.9,3 8.8,3 C13.7,3 17.6,6.9 17.6,11.8 L17.6,11.8 C17.5,16.6 13.6,20.5 8.8,20.5 Z M8.8,4.5 C4.8,4.5 1.6,7.7 1.6,11.8 C1.6,15.9 4.7,19 8.8,19 C12.9,19 16,15.8 16,11.8 L16,11.8 C16,7.8 12.8,4.5 8.8,4.5 Z" id="Shape"></path>
                <path d="M12.8,5.5 C12.4,5.5 12,5.2 12,4.7 L12,1.5 L6.5,1.5 L6.5,4.4 C6.5,4.8 6.2,5 5.7,5 C5.2,5 5,4.8 5,4.3 L5,1.4 C5,0.6 5.6,0 6.4,0 L12,0 C12.8,0 13.5,0.7 13.5,1.5 L13.5,4.9 C13.5,5.2 13.1,5.5 12.8,5.5 Z" id="Shape"></path>
                <path d="M6.5,24.5 C5.7,24.5 5,23.8 5,23 L5,19.1 C5,18.7 5.3,18.5249996 5.8,18.5249996 C6.3,18.5249996 6.6,18.6 6.6,19.1 L6.6,23 L12,23 L12,18.8 C12,18.4 12.3,18 12.8,18 C13.2,18 13.6,18.3 13.6,18.8 L13.6,23.1 C13.5,23.9 12.8,24.6 12,24.5 C12,24.5 10.1666667,24.5 6.5,24.5 Z" id="Shape"></path>
                <path d="M8.5,13.2 C8.4,13.2 8.2,13.2 8.1,13.1 L5.3,11.6 C4.9,11.4 4.7,10.9 4.9,10.5 C5.1,10 5.7,9.8 6.1,10 C6.1,10 6.2,10 6.2,10.1 L8.4,11.3 L12.1,8.2 C12.4,7.9 13,7.9 13.3,8.2 C13.6,8.5 13.6,9.1 13.3,9.4 C13.3,9.4 13.2,9.4 13.2,9.5 L9,13 C8.9,13.1 8.7,13.2 8.5,13.2 Z" id="Shape"></path>
                <path d="M17.4,10 L18,10 C18.6,10 19.1,10.5 19.1,11.1 C19.1,11.1 19.1,11.1 19.1,11.1 L19.1,12.4 C19.1,13 18.6,13.5 18,13.5 C18,13.5 18,13.5 17.9,13.5 L17.3,13.5 C16.7,13.5 16.2,13 16.2,12.4 C16.2,12.4 16.2,12.4 16.2,12.4 L16.2,11.1 C16.2,10.5 16.7,10 17.4,10 C17.3,10 17.3,10 17.4,10 Z" id="Shape"></path>
            </g>
        </g>
    </g>
</svg>