<?xml version="1.0" encoding="UTF-8"?>
<svg width="10px" height="10px" viewBox="0 0 10 10" version="1.1" xmlns="http://www.w3.org/2000/svg" xmlns:xlink="http://www.w3.org/1999/xlink">
    <!-- Generator: Sketch 47.1 (45422) - http://www.bohemiancoding.com/sketch -->
    <title>Light/Select/Arrow</title>
    <desc>Created with Sketch.</desc>
    <defs></defs>
    <g id="Symbols" stroke="none" stroke-width="1" fill="none" fill-rule="evenodd">
        <g id="Light/Select/Arrow" fill="#596372">
            <path d="M2.8514534,7.05031611 L2.8514534,1.95317021 C2.8514534,1.68265 2.62534755,1.44974747 2.34643186,1.44974747 L1.95761223,1.44974747 C1.67116298,1.44974747 1.45259069,1.67513751 1.45259069,1.95317021 L1.45259069,7.50217696 C1.45071257,7.51964754 1.44974747,7.53738318 1.44974747,7.55533765 L1.44974747,7.94415728 C1.44974747,8.21403243 1.64980971,8.42365817 1.90547104,8.44701278 C1.92261198,8.44881954 1.9400069,8.44974747 1.95761223,8.44974747 L2.34643186,8.44974747 C2.35476983,8.44974747 2.36305029,8.4495565 2.37126953,8.44917882 L7.94632473,8.44917882 C8.21684494,8.44917882 8.44974747,8.22307298 8.44974747,7.94415728 L8.44974747,7.55533765 C8.44974747,7.26888841 8.22435743,7.05031611 7.94632473,7.05031611 L2.8514534,7.05031611 Z" id="Arrow" transform="translate(4.949747, 4.949747) rotate(-45.000000) translate(-4.949747, -4.949747) "></path>
        </g>
    </g>
</svg>