<?xml version="1.0" encoding="UTF-8"?>
<svg width="12px" height="12px" viewBox="0 0 12 12" version="1.1" xmlns="http://www.w3.org/2000/svg" xmlns:xlink="http://www.w3.org/1999/xlink">
    <!-- Generator: Sketch 47.1 (45422) - http://www.bohemiancoding.com/sketch -->
    <title>WB/Left</title>
    <desc>Created with Sketch.</desc>
    <defs></defs>
    <g id="Symbols" stroke="none" stroke-width="1" fill="none" fill-rule="evenodd">
        <g id="WB/Left" fill="#455A64">
            <path d="M3.25880388,8.32000887 L3.25880388,2.41979482 C3.25880388,2.15015581 3.03233216,1.91935899 2.75296513,1.91935899 L2.16594239,1.91935899 C1.88239606,1.91935899 1.66010364,2.14341175 1.66010364,2.41979482 L1.66010364,8.76869125 C1.65795856,8.78745198 1.65685425,8.80652326 1.65685425,8.82584762 L1.65685425,9.41287037 C1.65685425,9.68519179 1.86351873,9.90101309 2.12472277,9.91767399 C2.13831794,9.91878948 2.1520649,9.91935899 2.16594239,9.91935899 L2.75296513,9.91935899 C2.76181717,9.91935899 2.7706095,9.91914063 2.77933724,9.91870912 L9.15641842,9.91870912 C9.42605744,9.91870912 9.65685425,9.69223739 9.65685425,9.41287037 L9.65685425,8.82584762 C9.65685425,8.54230129 9.4328015,8.32000887 9.15641842,8.32000887 L3.25880388,8.32000887 Z" id="Arrow" transform="translate(5.656854, 5.919359) rotate(45.000000) translate(-5.656854, -5.919359) "></path>
        </g>
    </g>
</svg>