<?xml version="1.0" encoding="UTF-8"?>
<svg width="11px" height="7px" viewBox="0 0 11 7" version="1.1" xmlns="http://www.w3.org/2000/svg" xmlns:xlink="http://www.w3.org/1999/xlink">
    <!-- Generator: Sketch 47.1 (45422) - http://www.bohemiancoding.com/sketch -->
    <title>Select Down/Disabled</title>
    <desc>Created with Sketch.</desc>
    <defs></defs>
    <g id="Symbols" stroke="none" stroke-width="1" fill="none" fill-rule="evenodd">
        <g id="Select-Down/Disabled" fill="#AFAFAF">
            <g id="Select-Down">
                <polygon id="Expand" transform="translate(5.646624, 3.363376) rotate(-90.000000) translate(-5.646624, -3.363376) " points="8.65662403 -1.63662405 2.63662405 3.3638747 8.65662403 8.36337595"></polygon>
            </g>
        </g>
    </g>
</svg>