{
	"firstName": "Dora",
	"lastName": "Emon",
	"email": "doraemon@mail.com",
	"password": "doraemon123",
	"isAdmin": true,
	"mobileNumber": "09123456789"
},
{
	"firstName": "Nob",
	"lastName": "Ita",
	"email": "nobita@mail.com",
	"password": "nobita123",
	"isAdmin": false,
	"mobileNumber": "09129876543"
}