{
	"name": "Takecopter",
	"description": "It can fly you.",
	"price": 2000,
	"stocks": "5",
	"isActive": true,
	"SKU": "1233QWER"
},
{
	"name": "Anywhere Door",
	"description": "It can transport you anywhere.",
	"price": 5000,
	"stocks": "2",
	"isActive": true,
	"SKU": "3321REWQ"
}


