%YAML 1.1
%TAG !u! tag:unity3d.com,2011:
--- !u!1001 &3506197516511248073
PrefabInstance:
  m_ObjectHideFlags: 0
  serializedVersion: 2
  m_Modification:
    m_TransformParent: {fileID: 0}
    m_Modifications:
    - target: {fileID: 3136363569451093568, guid: 242ed9adbf617a548baceedc9d80ff4e,
        type: 3}
      propertyPath: attachedTo
      value: 
      objectReference: {fileID: 0}
    - target: {fileID: 6595163736825283816, guid: 242ed9adbf617a548baceedc9d80ff4e,
        type: 3}
      propertyPath: m_RootOrder
      value: 0
      objectReference: {fileID: 0}
    - target: {fileID: 6595163736825283816, guid: 242ed9adbf617a548baceedc9d80ff4e,
        type: 3}
      propertyPath: m_LocalPosition.x
      value: 0
      objectReference: {fileID: 0}
    - target: {fileID: 6595163736825283816, guid: 242ed9adbf617a548baceedc9d80ff4e,
        type: 3}
      propertyPath: m_LocalPosition.y
      value: 0
      objectReference: {fileID: 0}
    - target: {fileID: 6595163736825283816, guid: 242ed9adbf617a548baceedc9d80ff4e,
        type: 3}
      propertyPath: m_LocalPosition.z
      value: 0
      objectReference: {fileID: 0}
    - target: {fileID: 6595163736825283816, guid: 242ed9adbf617a548baceedc9d80ff4e,
        type: 3}
      propertyPath: m_LocalRotation.w
      value: 1
      objectReference: {fileID: 0}
    - target: {fileID: 6595163736825283816, guid: 242ed9adbf617a548baceedc9d80ff4e,
        type: 3}
      propertyPath: m_LocalRotation.x
      value: 0
      objectReference: {fileID: 0}
    - target: {fileID: 6595163736825283816, guid: 242ed9adbf617a548baceedc9d80ff4e,
        type: 3}
      propertyPath: m_LocalRotation.y
      value: 0
      objectReference: {fileID: 0}
    - target: {fileID: 6595163736825283816, guid: 242ed9adbf617a548baceedc9d80ff4e,
        type: 3}
      propertyPath: m_LocalRotation.z
      value: 0
      objectReference: {fileID: 0}
    - target: {fileID: 6595163736825283816, guid: 242ed9adbf617a548baceedc9d80ff4e,
        type: 3}
      propertyPath: m_LocalEulerAnglesHint.x
      value: 0
      objectReference: {fileID: 0}
    - target: {fileID: 6595163736825283816, guid: 242ed9adbf617a548baceedc9d80ff4e,
        type: 3}
      propertyPath: m_LocalEulerAnglesHint.y
      value: 0
      objectReference: {fileID: 0}
    - target: {fileID: 6595163736825283816, guid: 242ed9adbf617a548baceedc9d80ff4e,
        type: 3}
      propertyPath: m_LocalEulerAnglesHint.z
      value: 0
      objectReference: {fileID: 0}
    - target: {fileID: 6595163736825283819, guid: 242ed9adbf617a548baceedc9d80ff4e,
        type: 3}
      propertyPath: m_Name
      value: Language Selection With Hints
      objectReference: {fileID: 0}
    - target: {fileID: 6595163736825283819, guid: 242ed9adbf617a548baceedc9d80ff4e,
        type: 3}
      propertyPath: m_IsActive
      value: 1
      objectReference: {fileID: 0}
    - target: {fileID: 6595163736901447585, guid: 242ed9adbf617a548baceedc9d80ff4e,
        type: 3}
      propertyPath: m_LocalPosition.x
      value: 0
      objectReference: {fileID: 0}
    - target: {fileID: 6595163736901447585, guid: 242ed9adbf617a548baceedc9d80ff4e,
        type: 3}
      propertyPath: m_LocalPosition.y
      value: 0
      objectReference: {fileID: 0}
    - target: {fileID: 6595163736901447585, guid: 242ed9adbf617a548baceedc9d80ff4e,
        type: 3}
      propertyPath: m_LocalPosition.z
      value: 0
      objectReference: {fileID: 0}
    - target: {fileID: 7008348197521831040, guid: 242ed9adbf617a548baceedc9d80ff4e,
        type: 3}
      propertyPath: onSelectedLanguage.m_PersistentCalls.m_Calls.Array.size
      value: 2
      objectReference: {fileID: 0}
    - target: {fileID: 7008348197521831040, guid: 242ed9adbf617a548baceedc9d80ff4e,
        type: 3}
      propertyPath: onSelectedLanguage.m_PersistentCalls.m_Calls.Array.data[0].m_Mode
      value: 6
      objectReference: {fileID: 0}
    - target: {fileID: 7008348197521831040, guid: 242ed9adbf617a548baceedc9d80ff4e,
        type: 3}
      propertyPath: onSelectedLanguage.m_PersistentCalls.m_Calls.Array.data[1].m_Mode
      value: 1
      objectReference: {fileID: 0}
    - target: {fileID: 7008348197521831040, guid: 242ed9adbf617a548baceedc9d80ff4e,
        type: 3}
      propertyPath: onSelectedLanguage.m_PersistentCalls.m_Calls.Array.data[0].m_Target
      value: 
      objectReference: {fileID: 0}
    - target: {fileID: 7008348197521831040, guid: 242ed9adbf617a548baceedc9d80ff4e,
        type: 3}
      propertyPath: onSelectedLanguage.m_PersistentCalls.m_Calls.Array.data[1].m_Target
      value: 
      objectReference: {fileID: 0}
    - target: {fileID: 7008348197521831040, guid: 242ed9adbf617a548baceedc9d80ff4e,
        type: 3}
      propertyPath: onSelectedLanguage.m_PersistentCalls.m_Calls.Array.data[0].m_CallState
      value: 2
      objectReference: {fileID: 0}
    - target: {fileID: 7008348197521831040, guid: 242ed9adbf617a548baceedc9d80ff4e,
        type: 3}
      propertyPath: onSelectedLanguage.m_PersistentCalls.m_Calls.Array.data[1].m_CallState
      value: 2
      objectReference: {fileID: 0}
    - target: {fileID: 7008348197521831040, guid: 242ed9adbf617a548baceedc9d80ff4e,
        type: 3}
      propertyPath: onSelectedLanguage.m_PersistentCalls.m_Calls.Array.data[0].m_MethodName
      value: SetActive
      objectReference: {fileID: 0}
    - target: {fileID: 7008348197521831040, guid: 242ed9adbf617a548baceedc9d80ff4e,
        type: 3}
      propertyPath: onSelectedLanguage.m_PersistentCalls.m_Calls.Array.data[1].m_MethodName
      value: StartStage
      objectReference: {fileID: 0}
    - target: {fileID: 7008348197521831040, guid: 242ed9adbf617a548baceedc9d80ff4e,
        type: 3}
      propertyPath: onSelectedLanguage.m_PersistentCalls.m_Calls.Array.data[0].m_TargetAssemblyTypeName
      value: UnityEngine.GameObject, UnityEngine
      objectReference: {fileID: 0}
    - target: {fileID: 7008348197521831040, guid: 242ed9adbf617a548baceedc9d80ff4e,
        type: 3}
      propertyPath: onSelectedLanguage.m_PersistentCalls.m_Calls.Array.data[1].m_TargetAssemblyTypeName
      value: RePiX_VR.TutorialStageManager, RePiX_VR
      objectReference: {fileID: 0}
    - target: {fileID: 7008348197521831040, guid: 242ed9adbf617a548baceedc9d80ff4e,
        type: 3}
      propertyPath: onSelectedLanguage.m_PersistentCalls.m_Calls.Array.data[0].m_Arguments.m_BoolArgument
      value: 1
      objectReference: {fileID: 0}
    - target: {fileID: 7008348197521831040, guid: 242ed9adbf617a548baceedc9d80ff4e,
        type: 3}
      propertyPath: onSelectedLanguage.m_PersistentCalls.m_Calls.Array.data[1].m_Arguments.m_BoolArgument
      value: 0
      objectReference: {fileID: 0}
    - target: {fileID: 7008348197521831040, guid: 242ed9adbf617a548baceedc9d80ff4e,
        type: 3}
      propertyPath: onSelectedLanguage.m_PersistentCalls.m_Calls.Array.data[0].m_Arguments.m_ObjectArgumentAssemblyTypeName
      value: UnityEngine.Object, UnityEngine
      objectReference: {fileID: 0}
    - target: {fileID: 7008348197521831040, guid: 242ed9adbf617a548baceedc9d80ff4e,
        type: 3}
      propertyPath: onSelectedLanguage.m_PersistentCalls.m_Calls.Array.data[1].m_Arguments.m_ObjectArgumentAssemblyTypeName
      value: UnityEngine.Object, UnityEngine
      objectReference: {fileID: 0}
    m_RemovedComponents: []
  m_SourcePrefab: {fileID: 100100000, guid: 242ed9adbf617a548baceedc9d80ff4e, type: 3}
