%YAML 1.1
%TAG !u! tag:unity3d.com,2011:
--- !u!114 &1825823905378042973
MonoBehaviour:
  m_ObjectHideFlags: 0
  m_CorrespondingSourceObject: {fileID: 0}
  m_PrefabInstance: {fileID: 0}
  m_PrefabAsset: {fileID: 0}
  m_GameObject: {fileID: 8844971578020407549}
  m_Enabled: 1
  m_EditorHideFlags: 0
  m_Script: {fileID: 11500000, guid: c505db976110d0e4a8fffdb299078570, type: 3}
  m_Name: 
  m_EditorClassIdentifier: 
  axis: 1
  degreesPerSecond: 90
--- !u!1001 &1903484600808022119
PrefabInstance:
  m_ObjectHideFlags: 0
  serializedVersion: 2
  m_Modification:
    m_TransformParent: {fileID: 0}
    m_Modifications:
    - target: {fileID: 6977535841565031918, guid: c4a6564798275dd428f93a9a6d8eaa53,
        type: 3}
      propertyPath: isLeftSide
      value: 1
      objectReference: {fileID: 0}
    - target: {fileID: 6977535842550253722, guid: c4a6564798275dd428f93a9a6d8eaa53,
        type: 3}
      propertyPath: m_Name
      value: RotationMatrix Variant
      objectReference: {fileID: 0}
    - target: {fileID: 6977535842550253723, guid: c4a6564798275dd428f93a9a6d8eaa53,
        type: 3}
      propertyPath: m_LocalPosition.x
      value: -0.15254104
      objectReference: {fileID: 0}
    - target: {fileID: 6977535842550253723, guid: c4a6564798275dd428f93a9a6d8eaa53,
        type: 3}
      propertyPath: m_LocalPosition.y
      value: 1.37
      objectReference: {fileID: 0}
    - target: {fileID: 6977535842550253723, guid: c4a6564798275dd428f93a9a6d8eaa53,
        type: 3}
      propertyPath: m_LocalPosition.z
      value: 1.487
      objectReference: {fileID: 0}
    - target: {fileID: 6977535842550253723, guid: c4a6564798275dd428f93a9a6d8eaa53,
        type: 3}
      propertyPath: m_LocalRotation.x
      value: 0
      objectReference: {fileID: 0}
    - target: {fileID: 6977535842550253723, guid: c4a6564798275dd428f93a9a6d8eaa53,
        type: 3}
      propertyPath: m_LocalRotation.y
      value: 0
      objectReference: {fileID: 0}
    - target: {fileID: 6977535842550253723, guid: c4a6564798275dd428f93a9a6d8eaa53,
        type: 3}
      propertyPath: m_LocalRotation.z
      value: 0
      objectReference: {fileID: 0}
    - target: {fileID: 6977535842550253723, guid: c4a6564798275dd428f93a9a6d8eaa53,
        type: 3}
      propertyPath: m_LocalRotation.w
      value: 1
      objectReference: {fileID: 0}
    - target: {fileID: 6977535842550253723, guid: c4a6564798275dd428f93a9a6d8eaa53,
        type: 3}
      propertyPath: m_RootOrder
      value: 0
      objectReference: {fileID: 0}
    - target: {fileID: 6977535842550253723, guid: c4a6564798275dd428f93a9a6d8eaa53,
        type: 3}
      propertyPath: m_LocalEulerAnglesHint.x
      value: 0
      objectReference: {fileID: 0}
    - target: {fileID: 6977535842550253723, guid: c4a6564798275dd428f93a9a6d8eaa53,
        type: 3}
      propertyPath: m_LocalEulerAnglesHint.y
      value: 0
      objectReference: {fileID: 0}
    - target: {fileID: 6977535842550253723, guid: c4a6564798275dd428f93a9a6d8eaa53,
        type: 3}
      propertyPath: m_LocalEulerAnglesHint.z
      value: 0
      objectReference: {fileID: 0}
    m_RemovedComponents: []
  m_SourcePrefab: {fileID: 100100000, guid: c4a6564798275dd428f93a9a6d8eaa53, type: 3}
--- !u!1 &8844971578020407549 stripped
GameObject:
  m_CorrespondingSourceObject: {fileID: 6977535842550253722, guid: c4a6564798275dd428f93a9a6d8eaa53,
    type: 3}
  m_PrefabInstance: {fileID: 1903484600808022119}
  m_PrefabAsset: {fileID: 0}
