{
"name": {
	"en-US": "unapproved",
	"de-DE": "nicht genehmigt"
},
"description": {
	"en-US": "Actor unapproved an object (in Moodle \"learning plan\")",
	"de-DE": "Akteur hat ein Objekt (in Moodle \"learning plan\") nicht genehmigt"
},
"exactMatch": [
],
"relatedMatch": [
]
}
