{
    "name": {
        "de-DE": "beteiligt sich sprachlich an Lösung der Aufgabe/stellt Fragen"
    },
    "description": {
        "de-DE": "Subscore (5/5 bzw. ++) wenn ein Akteuer sich sprachlich an Lösung der Aufgabe beteiligt/Fragen stellt"
    },
    "result":{
        "score":{
          "min": 1,
          "max": 5
        }
    }
}