{
    "name": {
        "en-US": "played",
        "de-DE": "spielte"
    },
    "description": {
        "en-US": "An actor played a game or something specific in a game.",
        "de-DE": "Ein Akteur spielte ein Spiel oder etwas spezifisches in einem Spiel."
    },
    "exactMatch": [
        "https://registry.tincanapi.com/#uri/verb/49",
        "https://activitystrea.ms/schema/1.0/play"
    ]
}