{
    "name": {
        "de-DE": "übt Bewegungen schnell/routiniert aus"
    },
    "description": {
        "de-DE": "Subscore (5/5 bzw. ++) wenn ein Akteuer Bewegungen schnell/routiniert ausübt"
    },
    "result":{
        "score":{
          "min": 1,
          "max": 5
        }
    }
}