﻿{
  "name": {
    "en-US": "planned time",
    "de-DE": "geplante Zeit"
  },
  "description": {
    "en-US": "The planned time for an event to happen.",
    "de-DE": "Die geplante Zeit, zu der ein Ereignis stattfinden soll."
  }
}