{
    "name": {
        "de-DE": "achtet auf anderenimmt Rücksicht"
    },
    "description": {
        "de-DE": "Subscore (5/5 bzw. ++) wenn ein Akteuer auf andere achtet/Rücksicht nimmt"
    },
    "result":{
        "score":{
          "min": 1,
          "max": 5
        }
    }
}