{
    "name": {
        "en-US": "Discussion",
        "de-DE": "Diskussion"
    },
    "description": {
        "en-US": "A single discussion/thread within a forum.",
        "de-DE": "Eine einzelne Diskussion in einem Forum."
    },
    "exactMatch": [ ],
    "relatedMatch": [ ]
}