{
    "name": {
        "en-US": "collectable",
        "de-DE": "einsammelbares Objekt"
    },
    "description": {
        "en-US": "Something which can be collected inside the game to fullfill a task or goal.",
        "de-DE": "Ein Objekt, welches im Spiel eingesammelt werden kann um ein Spielziel zu erreichen oder eine Aufgabe zu erfüllen."
    }
}