{
    "name": {
        "en-US": "searched",
        "de-DE": "suchte"
    },
    "description": {
        "en-US": "An actor searched for an item or searched a location.",
        "de-DE": "Ein Acteur oder ein Gruppe suchte nach einem Gegenstand oder zum Beispiel auch einen Ort ab."
    },
    "exactMatch": [
        "https://registry.tincanapi.com/#uri/verb/144",
        "https://activitystrea.ms/schema/1.0/search"
    ]
}
