%YAML 1.1
%TAG !u! tag:unity3d.com,2011:
--- !u!1001 &2316648514303436356
PrefabInstance:
  m_ObjectHideFlags: 0
  serializedVersion: 2
  m_Modification:
    m_TransformParent: {fileID: 0}
    m_Modifications:
    - target: {fileID: 2411288865704084096, guid: ecb9622063627d1498ca7faa13fb9d44,
        type: 3}
      propertyPath: m_RootOrder
      value: 0
      objectReference: {fileID: 0}
    - target: {fileID: 2411288865704084096, guid: ecb9622063627d1498ca7faa13fb9d44,
        type: 3}
      propertyPath: m_LocalPosition.x
      value: 0
      objectReference: {fileID: 0}
    - target: {fileID: 2411288865704084096, guid: ecb9622063627d1498ca7faa13fb9d44,
        type: 3}
      propertyPath: m_LocalPosition.y
      value: 0
      objectReference: {fileID: 0}
    - target: {fileID: 2411288865704084096, guid: ecb9622063627d1498ca7faa13fb9d44,
        type: 3}
      propertyPath: m_LocalPosition.z
      value: 0
      objectReference: {fileID: 0}
    - target: {fileID: 2411288865704084096, guid: ecb9622063627d1498ca7faa13fb9d44,
        type: 3}
      propertyPath: m_LocalRotation.w
      value: 1
      objectReference: {fileID: 0}
    - target: {fileID: 2411288865704084096, guid: ecb9622063627d1498ca7faa13fb9d44,
        type: 3}
      propertyPath: m_LocalRotation.x
      value: 0
      objectReference: {fileID: 0}
    - target: {fileID: 2411288865704084096, guid: ecb9622063627d1498ca7faa13fb9d44,
        type: 3}
      propertyPath: m_LocalRotation.y
      value: 0
      objectReference: {fileID: 0}
    - target: {fileID: 2411288865704084096, guid: ecb9622063627d1498ca7faa13fb9d44,
        type: 3}
      propertyPath: m_LocalRotation.z
      value: 0
      objectReference: {fileID: 0}
    - target: {fileID: 2411288865704084096, guid: ecb9622063627d1498ca7faa13fb9d44,
        type: 3}
      propertyPath: m_LocalEulerAnglesHint.x
      value: 0
      objectReference: {fileID: 0}
    - target: {fileID: 2411288865704084096, guid: ecb9622063627d1498ca7faa13fb9d44,
        type: 3}
      propertyPath: m_LocalEulerAnglesHint.y
      value: 0
      objectReference: {fileID: 0}
    - target: {fileID: 2411288865704084096, guid: ecb9622063627d1498ca7faa13fb9d44,
        type: 3}
      propertyPath: m_LocalEulerAnglesHint.z
      value: 0
      objectReference: {fileID: 0}
    - target: {fileID: 2411288865704084097, guid: ecb9622063627d1498ca7faa13fb9d44,
        type: 3}
      propertyPath: m_Name
      value: ScalingMatrix
      objectReference: {fileID: 0}
    m_RemovedComponents: []
  m_SourcePrefab: {fileID: 100100000, guid: ecb9622063627d1498ca7faa13fb9d44, type: 3}
--- !u!1 &94854859930182853 stripped
GameObject:
  m_CorrespondingSourceObject: {fileID: 2411288865704084097, guid: ecb9622063627d1498ca7faa13fb9d44,
    type: 3}
  m_PrefabInstance: {fileID: 2316648514303436356}
  m_PrefabAsset: {fileID: 0}
--- !u!114 &1383343928449789168
MonoBehaviour:
  m_ObjectHideFlags: 0
  m_CorrespondingSourceObject: {fileID: 0}
  m_PrefabInstance: {fileID: 0}
  m_PrefabAsset: {fileID: 0}
  m_GameObject: {fileID: 94854859930182853}
  m_Enabled: 1
  m_EditorHideFlags: 0
  m_Script: {fileID: 11500000, guid: aa9d158ece59e574fbed9f634c148412, type: 3}
  m_Name: 
  m_EditorClassIdentifier: 
  scale: {x: 1, y: 1, z: 1}
  animated: 0
  speed: 1
