%YAML 1.1
%TAG !u! tag:unity3d.com,2011:
--- !u!1001 &4045508578977959649
PrefabInstance:
  m_ObjectHideFlags: 0
  serializedVersion: 2
  m_Modification:
    m_TransformParent: {fileID: 0}
    m_Modifications:
    - target: {fileID: 1184852449337135573, guid: 85e4bbb1a21d2cc49af5f7077abffcd9,
        type: 3}
      propertyPath: m_Pivot.x
      value: 0.5
      objectReference: {fileID: 0}
    - target: {fileID: 1184852449337135573, guid: 85e4bbb1a21d2cc49af5f7077abffcd9,
        type: 3}
      propertyPath: m_Pivot.y
      value: 0.5
      objectReference: {fileID: 0}
    - target: {fileID: 1184852449337135573, guid: 85e4bbb1a21d2cc49af5f7077abffcd9,
        type: 3}
      propertyPath: m_RootOrder
      value: 0
      objectReference: {fileID: 0}
    - target: {fileID: 1184852449337135573, guid: 85e4bbb1a21d2cc49af5f7077abffcd9,
        type: 3}
      propertyPath: m_AnchorMax.x
      value: 0.5
      objectReference: {fileID: 0}
    - target: {fileID: 1184852449337135573, guid: 85e4bbb1a21d2cc49af5f7077abffcd9,
        type: 3}
      propertyPath: m_AnchorMax.y
      value: 0.5
      objectReference: {fileID: 0}
    - target: {fileID: 1184852449337135573, guid: 85e4bbb1a21d2cc49af5f7077abffcd9,
        type: 3}
      propertyPath: m_AnchorMin.x
      value: 0.5
      objectReference: {fileID: 0}
    - target: {fileID: 1184852449337135573, guid: 85e4bbb1a21d2cc49af5f7077abffcd9,
        type: 3}
      propertyPath: m_AnchorMin.y
      value: 0.5
      objectReference: {fileID: 0}
    - target: {fileID: 1184852449337135573, guid: 85e4bbb1a21d2cc49af5f7077abffcd9,
        type: 3}
      propertyPath: m_SizeDelta.x
      value: 64
      objectReference: {fileID: 0}
    - target: {fileID: 1184852449337135573, guid: 85e4bbb1a21d2cc49af5f7077abffcd9,
        type: 3}
      propertyPath: m_SizeDelta.y
      value: 64
      objectReference: {fileID: 0}
    - target: {fileID: 1184852449337135573, guid: 85e4bbb1a21d2cc49af5f7077abffcd9,
        type: 3}
      propertyPath: m_LocalPosition.x
      value: 0
      objectReference: {fileID: 0}
    - target: {fileID: 1184852449337135573, guid: 85e4bbb1a21d2cc49af5f7077abffcd9,
        type: 3}
      propertyPath: m_LocalPosition.y
      value: 0
      objectReference: {fileID: 0}
    - target: {fileID: 1184852449337135573, guid: 85e4bbb1a21d2cc49af5f7077abffcd9,
        type: 3}
      propertyPath: m_LocalPosition.z
      value: 0
      objectReference: {fileID: 0}
    - target: {fileID: 1184852449337135573, guid: 85e4bbb1a21d2cc49af5f7077abffcd9,
        type: 3}
      propertyPath: m_LocalRotation.w
      value: 1
      objectReference: {fileID: 0}
    - target: {fileID: 1184852449337135573, guid: 85e4bbb1a21d2cc49af5f7077abffcd9,
        type: 3}
      propertyPath: m_LocalRotation.x
      value: -0
      objectReference: {fileID: 0}
    - target: {fileID: 1184852449337135573, guid: 85e4bbb1a21d2cc49af5f7077abffcd9,
        type: 3}
      propertyPath: m_LocalRotation.y
      value: -0
      objectReference: {fileID: 0}
    - target: {fileID: 1184852449337135573, guid: 85e4bbb1a21d2cc49af5f7077abffcd9,
        type: 3}
      propertyPath: m_LocalRotation.z
      value: -0
      objectReference: {fileID: 0}
    - target: {fileID: 1184852449337135573, guid: 85e4bbb1a21d2cc49af5f7077abffcd9,
        type: 3}
      propertyPath: m_AnchoredPosition.x
      value: -0.064
      objectReference: {fileID: 0}
    - target: {fileID: 1184852449337135573, guid: 85e4bbb1a21d2cc49af5f7077abffcd9,
        type: 3}
      propertyPath: m_AnchoredPosition.y
      value: 0.074
      objectReference: {fileID: 0}
    - target: {fileID: 1184852449337135573, guid: 85e4bbb1a21d2cc49af5f7077abffcd9,
        type: 3}
      propertyPath: m_LocalEulerAnglesHint.x
      value: 0
      objectReference: {fileID: 0}
    - target: {fileID: 1184852449337135573, guid: 85e4bbb1a21d2cc49af5f7077abffcd9,
        type: 3}
      propertyPath: m_LocalEulerAnglesHint.y
      value: 0
      objectReference: {fileID: 0}
    - target: {fileID: 1184852449337135573, guid: 85e4bbb1a21d2cc49af5f7077abffcd9,
        type: 3}
      propertyPath: m_LocalEulerAnglesHint.z
      value: 0
      objectReference: {fileID: 0}
    - target: {fileID: 4390870155378761690, guid: 85e4bbb1a21d2cc49af5f7077abffcd9,
        type: 3}
      propertyPath: m_Name
      value: YCheckbox Variant
      objectReference: {fileID: 0}
    - target: {fileID: 5214720722209253605, guid: 85e4bbb1a21d2cc49af5f7077abffcd9,
        type: 3}
      propertyPath: m_text
      value: y-Axis
      objectReference: {fileID: 0}
    m_RemovedComponents: []
  m_SourcePrefab: {fileID: 100100000, guid: 85e4bbb1a21d2cc49af5f7077abffcd9, type: 3}
