{
    "name": {
        "en-US": "added",
        "de-DE": "hinzugefügt"
    },
    "description": {
        "en-US": "Actor added an object/person to a collection",
        "de-DE": "Akteur hat eine/n Person/Gegenstand zu einer Sammlung hinzugefügt"
    },
    "exactMatch": [
        "https://activitystrea.ms/registry/verbs/",
        "https://registry.tincanapi.com/#uri/verb/83"
    ],
    "relatedMatch": [
    ]
}
