{
  "name": {
    "en-US": "Explanation",
    "de-DE": "Erklärung"
  },
  "description": {
    "en-US": "Additional explanation or information that serves the understanding of the game content.",
    "de-DE": "Zusätzliche Erklärung oder Informationen, die dem Verständis der Spielinhalte dienen."
  }
}
