%YAML 1.1
%TAG !u! tag:unity3d.com,2011:
--- !u!1001 &8175791219359064400
PrefabInstance:
  m_ObjectHideFlags: 0
  serializedVersion: 2
  m_Modification:
    m_TransformParent: {fileID: 0}
    m_Modifications:
    - target: {fileID: 4506379558663679042, guid: 249a9f089b3fa9e4fb163db5b2b316ea,
        type: 3}
      propertyPath: m_Pivot.x
      value: 0.5
      objectReference: {fileID: 0}
    - target: {fileID: 4506379558663679042, guid: 249a9f089b3fa9e4fb163db5b2b316ea,
        type: 3}
      propertyPath: m_Pivot.y
      value: 0.5
      objectReference: {fileID: 0}
    - target: {fileID: 4506379558663679042, guid: 249a9f089b3fa9e4fb163db5b2b316ea,
        type: 3}
      propertyPath: m_RootOrder
      value: 0
      objectReference: {fileID: 0}
    - target: {fileID: 4506379558663679042, guid: 249a9f089b3fa9e4fb163db5b2b316ea,
        type: 3}
      propertyPath: m_AnchorMax.x
      value: 0
      objectReference: {fileID: 0}
    - target: {fileID: 4506379558663679042, guid: 249a9f089b3fa9e4fb163db5b2b316ea,
        type: 3}
      propertyPath: m_AnchorMax.y
      value: 0
      objectReference: {fileID: 0}
    - target: {fileID: 4506379558663679042, guid: 249a9f089b3fa9e4fb163db5b2b316ea,
        type: 3}
      propertyPath: m_AnchorMin.x
      value: 0
      objectReference: {fileID: 0}
    - target: {fileID: 4506379558663679042, guid: 249a9f089b3fa9e4fb163db5b2b316ea,
        type: 3}
      propertyPath: m_AnchorMin.y
      value: 0
      objectReference: {fileID: 0}
    - target: {fileID: 4506379558663679042, guid: 249a9f089b3fa9e4fb163db5b2b316ea,
        type: 3}
      propertyPath: m_SizeDelta.x
      value: 1
      objectReference: {fileID: 0}
    - target: {fileID: 4506379558663679042, guid: 249a9f089b3fa9e4fb163db5b2b316ea,
        type: 3}
      propertyPath: m_SizeDelta.y
      value: 1
      objectReference: {fileID: 0}
    - target: {fileID: 4506379558663679042, guid: 249a9f089b3fa9e4fb163db5b2b316ea,
        type: 3}
      propertyPath: m_LocalPosition.x
      value: 0
      objectReference: {fileID: 0}
    - target: {fileID: 4506379558663679042, guid: 249a9f089b3fa9e4fb163db5b2b316ea,
        type: 3}
      propertyPath: m_LocalPosition.y
      value: 0
      objectReference: {fileID: 0}
    - target: {fileID: 4506379558663679042, guid: 249a9f089b3fa9e4fb163db5b2b316ea,
        type: 3}
      propertyPath: m_LocalPosition.z
      value: -0.7999995
      objectReference: {fileID: 0}
    - target: {fileID: 4506379558663679042, guid: 249a9f089b3fa9e4fb163db5b2b316ea,
        type: 3}
      propertyPath: m_LocalRotation.w
      value: 1
      objectReference: {fileID: 0}
    - target: {fileID: 4506379558663679042, guid: 249a9f089b3fa9e4fb163db5b2b316ea,
        type: 3}
      propertyPath: m_LocalRotation.x
      value: -0
      objectReference: {fileID: 0}
    - target: {fileID: 4506379558663679042, guid: 249a9f089b3fa9e4fb163db5b2b316ea,
        type: 3}
      propertyPath: m_LocalRotation.y
      value: -0
      objectReference: {fileID: 0}
    - target: {fileID: 4506379558663679042, guid: 249a9f089b3fa9e4fb163db5b2b316ea,
        type: 3}
      propertyPath: m_LocalRotation.z
      value: -0
      objectReference: {fileID: 0}
    - target: {fileID: 4506379558663679042, guid: 249a9f089b3fa9e4fb163db5b2b316ea,
        type: 3}
      propertyPath: m_AnchoredPosition.x
      value: 1.76
      objectReference: {fileID: 0}
    - target: {fileID: 4506379558663679042, guid: 249a9f089b3fa9e4fb163db5b2b316ea,
        type: 3}
      propertyPath: m_AnchoredPosition.y
      value: -3.3200073
      objectReference: {fileID: 0}
    - target: {fileID: 4506379558663679042, guid: 249a9f089b3fa9e4fb163db5b2b316ea,
        type: 3}
      propertyPath: m_LocalEulerAnglesHint.x
      value: 0
      objectReference: {fileID: 0}
    - target: {fileID: 4506379558663679042, guid: 249a9f089b3fa9e4fb163db5b2b316ea,
        type: 3}
      propertyPath: m_LocalEulerAnglesHint.y
      value: 0
      objectReference: {fileID: 0}
    - target: {fileID: 4506379558663679042, guid: 249a9f089b3fa9e4fb163db5b2b316ea,
        type: 3}
      propertyPath: m_LocalEulerAnglesHint.z
      value: 0
      objectReference: {fileID: 0}
    - target: {fileID: 4506379558663679045, guid: 249a9f089b3fa9e4fb163db5b2b316ea,
        type: 3}
      propertyPath: m_Name
      value: TRS Panel Variant
      objectReference: {fileID: 0}
    - target: {fileID: 4506379558831858847, guid: 249a9f089b3fa9e4fb163db5b2b316ea,
        type: 3}
      propertyPath: m_Color.g
      value: 0
      objectReference: {fileID: 0}
    - target: {fileID: 4506379558831858847, guid: 249a9f089b3fa9e4fb163db5b2b316ea,
        type: 3}
      propertyPath: m_Color.r
      value: 0
      objectReference: {fileID: 0}
    m_RemovedComponents: []
  m_SourcePrefab: {fileID: 100100000, guid: 249a9f089b3fa9e4fb163db5b2b316ea, type: 3}
--- !u!1 &5764570821766206673 stripped
GameObject:
  m_CorrespondingSourceObject: {fileID: 4506379558547846529, guid: 249a9f089b3fa9e4fb163db5b2b316ea,
    type: 3}
  m_PrefabInstance: {fileID: 8175791219359064400}
  m_PrefabAsset: {fileID: 0}
--- !u!114 &2669754561603691266
MonoBehaviour:
  m_ObjectHideFlags: 0
  m_CorrespondingSourceObject: {fileID: 0}
  m_PrefabInstance: {fileID: 0}
  m_PrefabAsset: {fileID: 0}
  m_GameObject: {fileID: 5764570821766206673}
  m_Enabled: 0
  m_EditorHideFlags: 0
  m_Script: {fileID: 11500000, guid: c40db17d39f44e84a9460b3dcf939f36, type: 3}
  m_Name: 
  m_EditorClassIdentifier: 
  applyColorsOnStart: 0
  defaultColor: {r: 1, g: 1, b: 1, a: 1}
  highlightColor: {r: 0.9974991, g: 1, b: 0, a: 1}
--- !u!114 &2959679815142968637
MonoBehaviour:
  m_ObjectHideFlags: 0
  m_CorrespondingSourceObject: {fileID: 0}
  m_PrefabInstance: {fileID: 0}
  m_PrefabAsset: {fileID: 0}
  m_GameObject: {fileID: 5764570821766206673}
  m_Enabled: 0
  m_EditorHideFlags: 0
  m_Script: {fileID: 11500000, guid: 5b7750c031f830e4c98f8b53c5f13f11, type: 3}
  m_Name: 
  m_EditorClassIdentifier: 
  applyColorsOnStart: 0
  defaultColor: {r: 1, g: 1, b: 1, a: 1}
  highlightColor: {r: 1, g: 1, b: 0, a: 1}
--- !u!114 &7249430419921585810
MonoBehaviour:
  m_ObjectHideFlags: 0
  m_CorrespondingSourceObject: {fileID: 0}
  m_PrefabInstance: {fileID: 0}
  m_PrefabAsset: {fileID: 0}
  m_GameObject: {fileID: 5764570821766206673}
  m_Enabled: 0
  m_EditorHideFlags: 0
  m_Script: {fileID: 11500000, guid: eed3ca35ab03c1d40918fe8765bc6693, type: 3}
  m_Name: 
  m_EditorClassIdentifier: 
  applyColorsOnStart: 0
  defaultColor: {r: 1, g: 1, b: 1, a: 1}
  highlightColor: {r: 1, g: 1, b: 0, a: 1}
