{
    "name": {
        "en-US": "gestured",
        "de-DE": "gestikulierte"
    },
    "description": {
        "en-US": "An actor has gestured with part of her body (e.g. hands, feets, ...).",
        "de-DE": "Eine Akteurin gestikulierte mit einem ihrer Körperteile (z.B. Hände, Füße, ...)."
    }
}
