<?xml version="1.0" encoding="UTF-8" standalone="no"?>
<!-- Generator: Adobe Illustrator 16.0.0, SVG Export Plug-In . SVG Version: 6.00 Build 0)  -->

<svg
   xmlns:dc="http://purl.org/dc/elements/1.1/"
   xmlns:cc="http://creativecommons.org/ns#"
   xmlns:rdf="http://www.w3.org/1999/02/22-rdf-syntax-ns#"
   xmlns:svg="http://www.w3.org/2000/svg"
   xmlns="http://www.w3.org/2000/svg"
   xmlns:sodipodi="http://sodipodi.sourceforge.net/DTD/sodipodi-0.dtd"
   xmlns:inkscape="http://www.inkscape.org/namespaces/inkscape"
   version="1.1"
   id="Capa_1"
   x="0px"
   y="0px"
   width="528.899px"
   height="528.899px"
   viewBox="0 0 528.899 528.899"
   style="enable-background:new 0 0 528.899 528.899;"
   xml:space="preserve"
   inkscape:version="0.91 r13725"
   sodipodi:docname="pencil.svg"><metadata
   id="metadata4175"><rdf:RDF><cc:Work
       rdf:about=""><dc:format>image/svg+xml</dc:format><dc:type
         rdf:resource="http://purl.org/dc/dcmitype/StillImage" /><dc:title></dc:title></cc:Work></rdf:RDF></metadata><defs
   id="defs4173" /><sodipodi:namedview
   pagecolor="#ffffff"
   bordercolor="#666666"
   borderopacity="1"
   objecttolerance="10"
   gridtolerance="10"
   guidetolerance="10"
   inkscape:pageopacity="0"
   inkscape:pageshadow="2"
   inkscape:window-width="1920"
   inkscape:window-height="1017"
   id="namedview4171"
   showgrid="false"
   inkscape:zoom="1.5919864"
   inkscape:cx="264.44949"
   inkscape:cy="264.44949"
   inkscape:window-x="1912"
   inkscape:window-y="-8"
   inkscape:window-maximized="1"
   inkscape:current-layer="Capa_1" />
<g
   id="g4137"
   style="fill:#ffffff;fill-opacity:1">
	<path
   d="M328.883,89.125l107.59,107.589l-272.34,272.34L56.604,361.465L328.883,89.125z M518.113,63.177l-47.981-47.981   c-18.543-18.543-48.653-18.543-67.259,0l-45.961,45.961l107.59,107.59l53.611-53.611   C532.495,100.753,532.495,77.559,518.113,63.177z M0.3,512.69c-1.958,8.812,5.998,16.708,14.811,14.565l119.891-29.069   L27.473,390.597L0.3,512.69z"
   id="path4139"
   style="fill:#ffffff;fill-opacity:1" />
</g>
<g
   id="g4141">
</g>
<g
   id="g4143">
</g>
<g
   id="g4145">
</g>
<g
   id="g4147">
</g>
<g
   id="g4149">
</g>
<g
   id="g4151">
</g>
<g
   id="g4153">
</g>
<g
   id="g4155">
</g>
<g
   id="g4157">
</g>
<g
   id="g4159">
</g>
<g
   id="g4161">
</g>
<g
   id="g4163">
</g>
<g
   id="g4165">
</g>
<g
   id="g4167">
</g>
<g
   id="g4169">
</g>
</svg>