%YAML 1.1
%TAG !u! tag:unity3d.com,2011:
--- !u!1 &6290182467018250999
GameObject:
  m_ObjectHideFlags: 0
  m_CorrespondingSourceObject: {fileID: 0}
  m_PrefabInstance: {fileID: 0}
  m_PrefabAsset: {fileID: 0}
  serializedVersion: 6
  m_Component:
  - component: {fileID: 9125410728679209058}
  - component: {fileID: 1590422637550967580}
  m_Layer: 0
  m_Name: Learning Environment (with Ground)
  m_TagString: Untagged
  m_Icon: {fileID: 0}
  m_NavMeshLayer: 0
  m_StaticEditorFlags: 0
  m_IsActive: 1
--- !u!4 &9125410728679209058
Transform:
  m_ObjectHideFlags: 0
  m_CorrespondingSourceObject: {fileID: 0}
  m_PrefabInstance: {fileID: 0}
  m_PrefabAsset: {fileID: 0}
  m_GameObject: {fileID: 6290182467018250999}
  m_LocalRotation: {x: 0, y: 0, z: 0, w: 1}
  m_LocalPosition: {x: 0, y: 0, z: 0}
  m_LocalScale: {x: 1, y: 1, z: 1}
  m_ConstrainProportionsScale: 0
  m_Children:
  - {fileID: 6642210144803365480}
  - {fileID: 3039058645278482822}
  m_Father: {fileID: 0}
  m_RootOrder: 0
  m_LocalEulerAnglesHint: {x: 0, y: 0, z: 0}
--- !u!114 &1590422637550967580
MonoBehaviour:
  m_ObjectHideFlags: 0
  m_CorrespondingSourceObject: {fileID: 0}
  m_PrefabInstance: {fileID: 0}
  m_PrefabAsset: {fileID: 0}
  m_GameObject: {fileID: 6290182467018250999}
  m_Enabled: 1
  m_EditorHideFlags: 0
  m_Script: {fileID: 11500000, guid: 46de470dec652e54697cae4d9fb7159a, type: 3}
  m_Name: 
  m_EditorClassIdentifier: 
  language: 0
--- !u!1001 &4773834789567476904
PrefabInstance:
  m_ObjectHideFlags: 0
  serializedVersion: 2
  m_Modification:
    m_TransformParent: {fileID: 9125410728679209058}
    m_Modifications:
    - target: {fileID: 186469990343173386, guid: a301827499788ad499056a44c2556c23,
        type: 3}
      propertyPath: primaryHand
      value: 2
      objectReference: {fileID: 0}
    - target: {fileID: 2192636869166110400, guid: a301827499788ad499056a44c2556c23,
        type: 3}
      propertyPath: m_RootOrder
      value: 0
      objectReference: {fileID: 0}
    - target: {fileID: 2192636869166110400, guid: a301827499788ad499056a44c2556c23,
        type: 3}
      propertyPath: m_LocalPosition.x
      value: 0
      objectReference: {fileID: 0}
    - target: {fileID: 2192636869166110400, guid: a301827499788ad499056a44c2556c23,
        type: 3}
      propertyPath: m_LocalPosition.y
      value: 0
      objectReference: {fileID: 0}
    - target: {fileID: 2192636869166110400, guid: a301827499788ad499056a44c2556c23,
        type: 3}
      propertyPath: m_LocalPosition.z
      value: 0
      objectReference: {fileID: 0}
    - target: {fileID: 2192636869166110400, guid: a301827499788ad499056a44c2556c23,
        type: 3}
      propertyPath: m_LocalRotation.w
      value: 1
      objectReference: {fileID: 0}
    - target: {fileID: 2192636869166110400, guid: a301827499788ad499056a44c2556c23,
        type: 3}
      propertyPath: m_LocalRotation.x
      value: 0
      objectReference: {fileID: 0}
    - target: {fileID: 2192636869166110400, guid: a301827499788ad499056a44c2556c23,
        type: 3}
      propertyPath: m_LocalRotation.y
      value: 0
      objectReference: {fileID: 0}
    - target: {fileID: 2192636869166110400, guid: a301827499788ad499056a44c2556c23,
        type: 3}
      propertyPath: m_LocalRotation.z
      value: 0
      objectReference: {fileID: 0}
    - target: {fileID: 2192636869166110400, guid: a301827499788ad499056a44c2556c23,
        type: 3}
      propertyPath: m_LocalEulerAnglesHint.x
      value: 0
      objectReference: {fileID: 0}
    - target: {fileID: 2192636869166110400, guid: a301827499788ad499056a44c2556c23,
        type: 3}
      propertyPath: m_LocalEulerAnglesHint.y
      value: 0
      objectReference: {fileID: 0}
    - target: {fileID: 2192636869166110400, guid: a301827499788ad499056a44c2556c23,
        type: 3}
      propertyPath: m_LocalEulerAnglesHint.z
      value: 0
      objectReference: {fileID: 0}
    - target: {fileID: 2192636869166110407, guid: a301827499788ad499056a44c2556c23,
        type: 3}
      propertyPath: m_Name
      value: Learner
      objectReference: {fileID: 0}
    - target: {fileID: 7327659804820668090, guid: a301827499788ad499056a44c2556c23,
        type: 3}
      propertyPath: leftLaserPointer
      value: 
      objectReference: {fileID: 0}
    - target: {fileID: 7327659804820668090, guid: a301827499788ad499056a44c2556c23,
        type: 3}
      propertyPath: rightLaserPointer
      value: 
      objectReference: {fileID: 0}
    m_RemovedComponents: []
  m_SourcePrefab: {fileID: 100100000, guid: a301827499788ad499056a44c2556c23, type: 3}
--- !u!4 &6642210144803365480 stripped
Transform:
  m_CorrespondingSourceObject: {fileID: 2192636869166110400, guid: a301827499788ad499056a44c2556c23,
    type: 3}
  m_PrefabInstance: {fileID: 4773834789567476904}
  m_PrefabAsset: {fileID: 0}
--- !u!1 &6642210144803365487 stripped
GameObject:
  m_CorrespondingSourceObject: {fileID: 2192636869166110407, guid: a301827499788ad499056a44c2556c23,
    type: 3}
  m_PrefabInstance: {fileID: 4773834789567476904}
  m_PrefabAsset: {fileID: 0}
--- !u!108 &3493034107483517989
Light:
  m_ObjectHideFlags: 0
  m_CorrespondingSourceObject: {fileID: 0}
  m_PrefabInstance: {fileID: 0}
  m_PrefabAsset: {fileID: 0}
  m_GameObject: {fileID: 6642210144803365487}
  m_Enabled: 1
  serializedVersion: 10
  m_Type: 2
  m_Shape: 0
  m_Color: {r: 1, g: 1, b: 1, a: 1}
  m_Intensity: 1
  m_Range: 10
  m_SpotAngle: 30
  m_InnerSpotAngle: 21.80208
  m_CookieSize: 10
  m_Shadows:
    m_Type: 0
    m_Resolution: -1
    m_CustomResolution: -1
    m_Strength: 1
    m_Bias: 0.05
    m_NormalBias: 0.4
    m_NearPlane: 0.2
    m_CullingMatrixOverride:
      e00: 1
      e01: 0
      e02: 0
      e03: 0
      e10: 0
      e11: 1
      e12: 0
      e13: 0
      e20: 0
      e21: 0
      e22: 1
      e23: 0
      e30: 0
      e31: 0
      e32: 0
      e33: 1
    m_UseCullingMatrixOverride: 0
  m_Cookie: {fileID: 0}
  m_DrawHalo: 0
  m_Flare: {fileID: 0}
  m_RenderMode: 0
  m_CullingMask:
    serializedVersion: 2
    m_Bits: 823
  m_RenderingLayerMask: 1
  m_Lightmapping: 4
  m_LightShadowCasterMode: 0
  m_AreaSize: {x: 1, y: 1}
  m_BounceIntensity: 1
  m_ColorTemperature: 6570
  m_UseColorTemperature: 0
  m_BoundingSphereOverride: {x: 0, y: 0, z: 0, w: 0}
  m_UseBoundingSphereOverride: 0
  m_UseViewFrustumForShadowCasterCull: 1
  m_ShadowRadius: 0
  m_ShadowAngle: 0
--- !u!1001 &5289378622428508233
PrefabInstance:
  m_ObjectHideFlags: 0
  serializedVersion: 2
  m_Modification:
    m_TransformParent: {fileID: 9125410728679209058}
    m_Modifications:
    - target: {fileID: 7154885453005590991, guid: 6c8858c42aae9b64fb8b06096ff9368e,
        type: 3}
      propertyPath: m_RootOrder
      value: 1
      objectReference: {fileID: 0}
    - target: {fileID: 7154885453005590991, guid: 6c8858c42aae9b64fb8b06096ff9368e,
        type: 3}
      propertyPath: m_LocalPosition.x
      value: 0
      objectReference: {fileID: 0}
    - target: {fileID: 7154885453005590991, guid: 6c8858c42aae9b64fb8b06096ff9368e,
        type: 3}
      propertyPath: m_LocalPosition.y
      value: 0
      objectReference: {fileID: 0}
    - target: {fileID: 7154885453005590991, guid: 6c8858c42aae9b64fb8b06096ff9368e,
        type: 3}
      propertyPath: m_LocalPosition.z
      value: 0
      objectReference: {fileID: 0}
    - target: {fileID: 7154885453005590991, guid: 6c8858c42aae9b64fb8b06096ff9368e,
        type: 3}
      propertyPath: m_LocalRotation.w
      value: 1
      objectReference: {fileID: 0}
    - target: {fileID: 7154885453005590991, guid: 6c8858c42aae9b64fb8b06096ff9368e,
        type: 3}
      propertyPath: m_LocalRotation.x
      value: -0
      objectReference: {fileID: 0}
    - target: {fileID: 7154885453005590991, guid: 6c8858c42aae9b64fb8b06096ff9368e,
        type: 3}
      propertyPath: m_LocalRotation.y
      value: -0
      objectReference: {fileID: 0}
    - target: {fileID: 7154885453005590991, guid: 6c8858c42aae9b64fb8b06096ff9368e,
        type: 3}
      propertyPath: m_LocalRotation.z
      value: -0
      objectReference: {fileID: 0}
    - target: {fileID: 7154885453005590991, guid: 6c8858c42aae9b64fb8b06096ff9368e,
        type: 3}
      propertyPath: m_LocalEulerAnglesHint.x
      value: 0
      objectReference: {fileID: 0}
    - target: {fileID: 7154885453005590991, guid: 6c8858c42aae9b64fb8b06096ff9368e,
        type: 3}
      propertyPath: m_LocalEulerAnglesHint.y
      value: 0
      objectReference: {fileID: 0}
    - target: {fileID: 7154885453005590991, guid: 6c8858c42aae9b64fb8b06096ff9368e,
        type: 3}
      propertyPath: m_LocalEulerAnglesHint.z
      value: 0
      objectReference: {fileID: 0}
    - target: {fileID: 7154885453005842285, guid: 6c8858c42aae9b64fb8b06096ff9368e,
        type: 3}
      propertyPath: m_Name
      value: GroundArena
      objectReference: {fileID: 0}
    m_RemovedComponents: []
  m_SourcePrefab: {fileID: 100100000, guid: 6c8858c42aae9b64fb8b06096ff9368e, type: 3}
--- !u!4 &3039058645278482822 stripped
Transform:
  m_CorrespondingSourceObject: {fileID: 7154885453005590991, guid: 6c8858c42aae9b64fb8b06096ff9368e,
    type: 3}
  m_PrefabInstance: {fileID: 5289378622428508233}
  m_PrefabAsset: {fileID: 0}
