<svg width="41" height="30" viewBox="0 0 41 30" fill="none" xmlns="http://www.w3.org/2000/svg">
<path d="M30.9575 17.9721C31.4028 17.9721 31.8302 17.9042 32.2556 17.8423C32.1178 18.3056 31.976 18.7769 31.7483 19.2003C31.5206 19.8154 31.1652 20.3486 30.8117 20.8858C30.5161 21.467 29.9949 21.8604 29.6115 22.3576C29.21 22.8409 28.6629 23.1625 28.2295 23.5639C27.8041 23.9832 27.2469 24.1929 26.8036 24.4885C26.3403 24.7541 25.9369 25.0477 25.5055 25.1875L24.4291 25.6308L23.4825 26.0242L24.4511 29.8945L25.6433 29.607C26.0247 29.5111 26.4901 29.3993 27.0193 29.2655C27.5605 29.1656 28.1376 28.892 28.7807 28.6424C29.4157 28.3588 30.1507 28.1671 30.8337 27.7117C31.5206 27.2764 32.3135 26.9129 33.0124 26.3298C33.6894 25.7287 34.5062 25.2074 35.1093 24.4426C35.7684 23.7276 36.4194 22.9767 36.9247 22.122C37.5098 21.3072 37.9072 20.4125 38.3266 19.5278C38.706 18.6431 39.0116 17.7384 39.2612 16.8597C39.7345 15.0983 39.9462 13.4248 40.0281 11.9929C40.096 10.559 40.0561 9.36679 39.9722 8.50406C39.9422 8.09666 39.8863 7.70124 39.8464 7.42765L39.7964 7.09214L39.7445 7.10412C39.3893 5.44491 38.5716 3.92016 37.3861 2.70625C36.2005 1.49233 34.6955 0.638868 33.0451 0.244583C31.3947 -0.149702 29.6665 -0.0686989 28.0602 0.478222C26.454 1.02514 25.0354 2.01563 23.9686 3.33511C22.9017 4.65459 22.2302 6.24914 22.0318 7.93431C21.8333 9.61947 22.116 11.3264 22.8472 12.8576C23.5783 14.3888 24.728 15.6818 26.1632 16.5868C27.5985 17.4919 29.2607 17.9722 30.9575 17.9721ZM8.98986 17.9721C9.4352 17.9721 9.86257 17.9042 10.2879 17.8423C10.1501 18.3056 10.0084 18.7769 9.78069 19.2003C9.55302 19.8154 9.19755 20.3486 8.84407 20.8858C8.54851 21.467 8.02728 21.8604 7.64384 22.3576C7.24243 22.8409 6.69524 23.1625 6.26188 23.5639C5.83651 23.9832 5.27933 24.1929 4.83598 24.4885C4.37266 24.7541 3.96926 25.0477 3.5379 25.1875L2.46148 25.6308L1.51488 26.0242L2.48345 29.8945L3.67569 29.607C4.05713 29.5111 4.52244 29.3993 5.05166 29.2655C5.59286 29.1656 6.17001 28.892 6.81306 28.6424C7.44613 28.3568 8.18304 28.1671 8.86604 27.7098C9.55302 27.2744 10.3459 26.9109 11.0448 26.3278C11.7218 25.7267 12.5386 25.2054 13.1417 24.4426C13.8008 23.7276 14.4518 22.9767 14.9571 22.122C15.5422 21.3072 15.9396 20.4125 16.359 19.5278C16.7384 18.6431 17.044 17.7384 17.2936 16.8597C17.7669 15.0983 17.9786 13.4248 18.0605 11.9929C18.1284 10.559 18.0884 9.36679 18.0046 8.50406C17.9746 8.09666 17.9187 7.70124 17.8788 7.42765L17.8288 7.09214L17.7769 7.10412C17.4217 5.44491 16.604 3.92016 15.4185 2.70625C14.2329 1.49233 12.7279 0.638868 11.0775 0.244583C9.42714 -0.149702 7.69887 -0.0686989 6.09262 0.478222C4.48637 1.02514 3.06778 2.01563 2.00095 3.33511C0.934113 4.65459 0.262627 6.24914 0.0641785 7.93431C-0.13427 9.61947 0.148418 11.3264 0.879547 12.8576C1.61068 14.3888 2.76036 15.6818 4.19562 16.5868C5.63088 17.4919 7.29305 17.9722 8.98986 17.9721Z" fill="#18AD7D"/>
</svg>
