<svg width="22" height="22" viewBox="0 0 22 22" fill="none" xmlns="http://www.w3.org/2000/svg">
<path d="M10.7734 17.5313C7.16819 17.5313 4.24219 14.6053 4.24219 11C4.24219 8.79178 5.34081 6.8379 7.01969 5.6554C7.48581 5.32815 7.59719 4.68465 7.26994 4.21853C6.94131 3.75378 6.29781 3.64103 5.83306 3.96965C3.62344 5.52478 2.17969 8.09465 2.17969 11C2.17969 15.7424 6.02969 19.5938 10.7734 19.5938C11.3427 19.5938 11.8047 19.1318 11.8047 18.5625C11.8047 17.9933 11.3427 17.5313 10.7734 17.5313Z" fill="#1C71FF"/>
<path d="M11.1913 4.48248C14.5999 4.69973 17.3018 7.53635 17.3018 11C17.3018 12.991 16.4094 14.7744 15.0028 15.972C14.5697 16.3419 14.5174 16.9936 14.8873 17.4267C15.2558 17.8599 15.9075 17.9107 16.3407 17.5422C18.19 15.9651 19.3643 13.618 19.3643 11C19.3643 6.44323 15.8085 2.7101 11.3233 2.4241C10.7554 2.38698 10.2645 2.81873 10.2288 3.38798C10.1917 3.95585 10.6234 4.44535 11.1913 4.48248Z" fill="#1C71FF"/>
<path d="M18.7869 16.1563H15.9297V13.2991C15.9297 12.7298 15.4677 12.2678 14.8984 12.2678C14.3292 12.2678 13.8672 12.7298 13.8672 13.2991V17.1876C13.8672 17.7568 14.3292 18.2188 14.8984 18.2188H18.7869C19.3562 18.2188 19.8182 17.7568 19.8182 17.1876C19.8182 16.6183 19.3562 16.1563 18.7869 16.1563Z" fill="#1C71FF"/>
<path d="M3.21094 5.15625H6.06819V8.0135C6.06819 8.58275 6.53019 9.04475 7.09944 9.04475C7.66869 9.04475 8.13069 8.58275 8.13069 8.0135V4.125C8.13069 3.55575 7.66869 3.09375 7.09944 3.09375H3.21094C2.64169 3.09375 2.17969 3.55575 2.17969 4.125C2.17969 4.69425 2.64169 5.15625 3.21094 5.15625Z" fill="#1C71FF"/>
</svg>
