<svg width="220" height="511" viewBox="0 0 220 511" fill="none" xmlns="http://www.w3.org/2000/svg">
<path d="M191 34.5C218.5 66.5 239 162.5 185.5 229.5" stroke="#C8DAF6" stroke-width="2" stroke-dasharray="6 6"/>
<path d="M187 255.5C214.5 287.5 222 381.5 168.5 448.5" stroke="#C8DAF6" stroke-width="2" stroke-dasharray="6 6"/>
<path d="M187 30C187 36.6274 181.627 42 175 42C168.373 42 163 36.6274 163 30C163 23.3726 168.373 18 175 18C181.627 18 187 23.3726 187 30ZM169 30C169 33.3137 171.686 36 175 36C178.314 36 181 33.3137 181 30C181 26.6863 178.314 24 175 24C171.686 24 169 26.6863 169 30Z" fill="#7AACFF"/>
<circle cx="10" cy="10" r="10" transform="matrix(7.4073e-08 1 1 -2.57946e-08 165 20)" fill="#CADEFF"/>
<circle cx="7.5" cy="7.5" r="7.5" transform="matrix(7.4073e-08 1 1 -2.57946e-08 167.5 22.5)" fill="#94BCFF"/>
<circle cx="5" cy="5" r="5" transform="matrix(7.4073e-08 1 1 -2.57946e-08 170 25)" fill="#E0F0FF"/>
<circle cx="3.33333" cy="3.33333" r="3.33333" transform="matrix(7.4073e-08 1 1 -2.57946e-08 171.672 26.6641)" fill="#2D7BFF"/>
<path d="M188 243C188 249.627 182.627 255 176 255C169.373 255 164 249.627 164 243C164 236.373 169.373 231 176 231C182.627 231 188 236.373 188 243ZM170 243C170 246.314 172.686 249 176 249C179.314 249 182 246.314 182 243C182 239.686 179.314 237 176 237C172.686 237 170 239.686 170 243Z" fill="#EFF5FF"/>
<circle cx="10" cy="10" r="10" transform="matrix(7.4073e-08 1 1 -2.57946e-08 166 233)" fill="#CADEFF"/>
<circle cx="7.5" cy="7.5" r="7.5" transform="matrix(7.4073e-08 1 1 -2.57946e-08 168.5 235.5)" fill="#CFE8FF"/>
<circle cx="5" cy="5" r="5" transform="matrix(7.4073e-08 1 1 -2.57946e-08 171 238)" fill="#E0F0FF"/>
<circle cx="3.33333" cy="3.33333" r="3.33333" transform="matrix(7.4073e-08 1 1 -2.57946e-08 172.672 239.664)" fill="#D1E3FF"/>
<path d="M173 458C173 464.627 167.627 470 161 470C154.373 470 149 464.627 149 458C149 451.373 154.373 446 161 446C167.627 446 173 451.373 173 458ZM155 458C155 461.314 157.686 464 161 464C164.314 464 167 461.314 167 458C167 454.686 164.314 452 161 452C157.686 452 155 454.686 155 458Z" fill="#EFF5FF"/>
<circle cx="10" cy="10" r="10" transform="matrix(7.4073e-08 1 1 -2.57946e-08 151 448)" fill="#CADEFF"/>
<circle cx="7.5" cy="7.5" r="7.5" transform="matrix(7.4073e-08 1 1 -2.57946e-08 153.5 450.5)" fill="#CFE8FF"/>
<circle cx="5" cy="5" r="5" transform="matrix(7.4073e-08 1 1 -2.57946e-08 156 453)" fill="#E0F0FF"/>
<circle cx="3.33333" cy="3.33333" r="3.33333" transform="matrix(7.4073e-08 1 1 -2.57946e-08 157.672 454.664)" fill="#D1E3FF"/>
<g filter="url(#filter0_ddd_393_4960)">
<rect x="75" y="9" width="79" height="42" rx="10" fill="url(#paint0_linear_393_4960)"/>
<path d="M91.98 35V24.92H95.137C95.2303 24.92 95.403 24.9223 95.655 24.927C95.9117 24.9317 96.1567 24.9503 96.39 24.983C97.1787 25.081 97.8413 25.3633 98.378 25.83C98.9193 26.2967 99.3277 26.8893 99.603 27.608C99.8783 28.322 100.016 29.106 100.016 29.96C100.016 30.8187 99.8783 31.6073 99.603 32.326C99.3277 33.04 98.9193 33.6303 98.378 34.097C97.8413 34.559 97.1787 34.839 96.39 34.937C96.1567 34.9697 95.9117 34.9883 95.655 34.993C95.403 34.9977 95.2303 35 95.137 35H91.98ZM93.478 33.607H95.137C95.2957 33.607 95.4847 33.6023 95.704 33.593C95.9233 33.5837 96.117 33.565 96.285 33.537C96.7983 33.439 97.2137 33.2173 97.531 32.872C97.853 32.522 98.0887 32.0927 98.238 31.584C98.3873 31.0753 98.462 30.534 98.462 29.96C98.462 29.3673 98.385 28.819 98.231 28.315C98.077 27.8063 97.839 27.3817 97.517 27.041C97.1997 26.6957 96.789 26.4763 96.285 26.383C96.117 26.3503 95.921 26.3317 95.697 26.327C95.4777 26.3177 95.291 26.313 95.137 26.313H93.478V33.607ZM104.999 35.21C104.248 35.21 103.587 35.0467 103.018 34.72C102.453 34.3887 102.012 33.929 101.695 33.341C101.382 32.7483 101.226 32.0623 101.226 31.283C101.226 30.457 101.38 29.7407 101.688 29.134C102.001 28.5273 102.435 28.0583 102.99 27.727C103.545 27.3957 104.192 27.23 104.929 27.23C105.699 27.23 106.355 27.4097 106.896 27.769C107.437 28.1237 107.841 28.63 108.107 29.288C108.378 29.946 108.485 30.7277 108.429 31.633H106.966V31.101C106.957 30.2237 106.789 29.575 106.462 29.155C106.14 28.735 105.648 28.525 104.985 28.525C104.252 28.525 103.702 28.756 103.333 29.218C102.964 29.68 102.78 30.3473 102.78 31.22C102.78 32.0507 102.964 32.6947 103.333 33.152C103.702 33.6047 104.234 33.831 104.929 33.831C105.386 33.831 105.781 33.7283 106.112 33.523C106.448 33.313 106.709 33.0143 106.896 32.627L108.331 33.082C108.037 33.7587 107.591 34.2837 106.994 34.657C106.397 35.0257 105.732 35.21 104.999 35.21ZM102.304 31.633V30.492H107.701V31.633H102.304ZM112.891 35.203C111.971 35.203 111.222 35 110.644 34.594C110.065 34.188 109.71 33.6163 109.58 32.879L111.078 32.648C111.171 33.04 111.386 33.3503 111.722 33.579C112.062 33.803 112.485 33.915 112.989 33.915C113.446 33.915 113.803 33.8217 114.06 33.635C114.321 33.4483 114.452 33.1917 114.452 32.865C114.452 32.6737 114.405 32.5197 114.312 32.403C114.223 32.2817 114.034 32.1673 113.745 32.06C113.455 31.9527 113.014 31.8197 112.422 31.661C111.773 31.493 111.257 31.3133 110.875 31.122C110.497 30.926 110.226 30.6997 110.063 30.443C109.904 30.1817 109.825 29.8667 109.825 29.498C109.825 29.0407 109.946 28.6417 110.189 28.301C110.431 27.9603 110.772 27.6967 111.211 27.51C111.654 27.3233 112.172 27.23 112.765 27.23C113.343 27.23 113.859 27.321 114.312 27.503C114.764 27.685 115.131 27.944 115.411 28.28C115.691 28.6113 115.859 29.001 115.915 29.449L114.417 29.722C114.365 29.358 114.195 29.071 113.906 28.861C113.616 28.651 113.241 28.5367 112.779 28.518C112.335 28.4993 111.976 28.574 111.701 28.742C111.425 28.9053 111.288 29.1317 111.288 29.421C111.288 29.589 111.339 29.7313 111.442 29.848C111.549 29.9647 111.754 30.0767 112.058 30.184C112.361 30.2913 112.809 30.4197 113.402 30.569C114.036 30.7323 114.54 30.9143 114.914 31.115C115.287 31.311 115.553 31.5467 115.712 31.822C115.875 32.0927 115.957 32.4217 115.957 32.809C115.957 33.5557 115.684 34.1413 115.138 34.566C114.596 34.9907 113.847 35.203 112.891 35.203ZM117.645 26.201V24.78H119.108V26.201H117.645ZM117.645 35V27.44H119.108V35H117.645ZM124.325 38.57C123.919 38.57 123.525 38.507 123.142 38.381C122.764 38.255 122.419 38.0683 122.106 37.821C121.794 37.5783 121.535 37.2773 121.329 36.918L122.68 36.232C122.844 36.554 123.077 36.7897 123.38 36.939C123.684 37.0883 124.003 37.163 124.339 37.163C124.755 37.163 125.109 37.0883 125.403 36.939C125.697 36.7943 125.919 36.575 126.068 36.281C126.222 35.987 126.297 35.623 126.292 35.189V33.075H126.467V27.44H127.762V35.203C127.762 35.4037 127.755 35.595 127.741 35.777C127.727 35.959 127.702 36.141 127.664 36.323C127.557 36.8317 127.352 37.2517 127.048 37.583C126.75 37.9143 126.367 38.1617 125.9 38.325C125.438 38.4883 124.913 38.57 124.325 38.57ZM124.213 35.21C123.509 35.21 122.9 35.035 122.386 34.685C121.878 34.335 121.483 33.859 121.203 33.257C120.928 32.6503 120.79 31.969 120.79 31.213C120.79 30.4523 120.93 29.7733 121.21 29.176C121.49 28.574 121.887 28.1003 122.4 27.755C122.918 27.405 123.532 27.23 124.241 27.23C124.955 27.23 125.555 27.405 126.04 27.755C126.53 28.1003 126.899 28.574 127.146 29.176C127.398 29.778 127.524 30.457 127.524 31.213C127.524 31.969 127.398 32.648 127.146 33.25C126.894 33.852 126.523 34.3303 126.033 34.685C125.543 35.035 124.937 35.21 124.213 35.21ZM124.416 33.887C124.897 33.887 125.289 33.7727 125.592 33.544C125.896 33.3153 126.117 33.0003 126.257 32.599C126.397 32.1977 126.467 31.7357 126.467 31.213C126.467 30.6903 126.395 30.2283 126.25 29.827C126.11 29.4257 125.891 29.113 125.592 28.889C125.298 28.665 124.923 28.553 124.465 28.553C123.98 28.553 123.581 28.672 123.268 28.91C122.956 29.148 122.722 29.4677 122.568 29.869C122.419 30.2703 122.344 30.7183 122.344 31.213C122.344 31.7123 122.419 32.165 122.568 32.571C122.722 32.9723 122.951 33.292 123.254 33.53C123.562 33.768 123.95 33.887 124.416 33.887ZM135.034 35V31.283C135.034 30.989 135.008 30.688 134.957 30.38C134.91 30.0673 134.817 29.778 134.677 29.512C134.542 29.246 134.348 29.0313 134.096 28.868C133.849 28.7047 133.524 28.623 133.123 28.623C132.862 28.623 132.614 28.6673 132.381 28.756C132.148 28.84 131.942 28.9777 131.765 29.169C131.592 29.3603 131.455 29.6123 131.352 29.925C131.254 30.2377 131.205 30.618 131.205 31.066L130.295 30.723C130.295 30.037 130.423 29.4327 130.68 28.91C130.937 28.3827 131.305 27.972 131.786 27.678C132.267 27.384 132.848 27.237 133.529 27.237C134.052 27.237 134.49 27.321 134.845 27.489C135.2 27.657 135.487 27.8787 135.706 28.154C135.93 28.4247 136.1 28.721 136.217 29.043C136.334 29.365 136.413 29.68 136.455 29.988C136.497 30.296 136.518 30.5667 136.518 30.8V35H135.034ZM129.721 35V27.44H131.03V29.624H131.205V35H129.721Z" fill="white"/>
<path d="M161.866 32.5981C163.866 31.4434 163.866 28.5566 161.866 27.4019L154 22.8605V37.1395L161.866 32.5981Z" fill="#1C71FF"/>
</g>
<g filter="url(#filter1_ddd_393_4960)">
<rect x="58" y="221" width="94" height="42" rx="10" fill="url(#paint1_linear_393_4960)"/>
<path d="M79.124 247.21C78.1207 247.21 77.269 246.988 76.569 246.545C75.869 246.102 75.3347 245.486 74.966 244.697C74.602 243.908 74.42 242.996 74.42 241.96C74.42 240.924 74.602 240.012 74.966 239.223C75.3347 238.434 75.869 237.818 76.569 237.375C77.269 236.932 78.1207 236.71 79.124 236.71C80.2907 236.71 81.2497 237.006 82.001 237.599C82.757 238.192 83.2773 238.99 83.562 239.993L82.295 240.329C82.0897 239.578 81.7233 238.985 81.196 238.551C80.6687 238.117 79.978 237.9 79.124 237.9C78.3727 237.9 77.7473 238.07 77.248 238.411C76.7487 238.752 76.373 239.228 76.121 239.839C75.869 240.446 75.7407 241.153 75.736 241.96C75.7313 242.763 75.855 243.47 76.107 244.081C76.359 244.688 76.737 245.164 77.241 245.509C77.745 245.85 78.3727 246.02 79.124 246.02C79.978 246.02 80.6687 245.803 81.196 245.369C81.7233 244.93 82.0897 244.338 82.295 243.591L83.562 243.927C83.2773 244.926 82.757 245.724 82.001 246.321C81.2497 246.914 80.2907 247.21 79.124 247.21ZM88.3172 247.21C87.5659 247.21 86.9172 247.04 86.3712 246.699C85.8299 246.358 85.4122 245.887 85.1182 245.285C84.8242 244.683 84.6772 243.992 84.6772 243.213C84.6772 242.42 84.8265 241.724 85.1252 241.127C85.4239 240.53 85.8462 240.065 86.3922 239.734C86.9382 239.398 87.5799 239.23 88.3172 239.23C89.0732 239.23 89.7242 239.4 90.2702 239.741C90.8162 240.077 91.2339 240.546 91.5232 241.148C91.8172 241.745 91.9642 242.434 91.9642 243.213C91.9642 244.002 91.8172 244.697 91.5232 245.299C91.2292 245.896 90.8092 246.365 90.2632 246.706C89.7172 247.042 89.0685 247.21 88.3172 247.21ZM88.3172 246.027C89.1012 246.027 89.6845 245.766 90.0672 245.243C90.4499 244.72 90.6412 244.044 90.6412 243.213C90.6412 242.359 90.4475 241.68 90.0602 241.176C89.6729 240.667 89.0919 240.413 88.3172 240.413C87.7899 240.413 87.3559 240.532 87.0152 240.77C86.6745 241.008 86.4202 241.337 86.2522 241.757C86.0842 242.177 86.0002 242.662 86.0002 243.213C86.0002 244.062 86.1962 244.744 86.5882 245.257C86.9802 245.77 87.5565 246.027 88.3172 246.027ZM102.542 247L102.549 242.163C102.549 241.598 102.398 241.157 102.094 240.84C101.796 240.518 101.406 240.357 100.925 240.357C100.645 240.357 100.379 240.422 100.127 240.553C99.8754 240.679 99.6701 240.88 99.5114 241.155C99.3527 241.426 99.2734 241.773 99.2734 242.198L98.6154 241.932C98.6061 241.395 98.7157 240.926 98.9444 240.525C99.1777 240.119 99.4951 239.804 99.8964 239.58C100.298 239.356 100.75 239.244 101.254 239.244C102.043 239.244 102.664 239.484 103.116 239.965C103.569 240.441 103.795 241.083 103.795 241.89L103.788 247H102.542ZM93.4984 247V239.44H94.6114V241.463H94.7514V247H93.4984ZM98.0274 247L98.0344 242.212C98.0344 241.633 97.8851 241.181 97.5864 240.854C97.2877 240.523 96.8911 240.357 96.3964 240.357C95.9064 240.357 95.5097 240.525 95.2064 240.861C94.9031 241.197 94.7514 241.643 94.7514 242.198L94.0934 241.806C94.0934 241.316 94.2101 240.877 94.4434 240.49C94.6767 240.103 94.9941 239.799 95.3954 239.58C95.7967 239.356 96.2517 239.244 96.7604 239.244C97.2691 239.244 97.7124 239.351 98.0904 239.566C98.4684 239.781 98.7601 240.089 98.9654 240.49C99.1707 240.887 99.2734 241.36 99.2734 241.911L99.2664 247H98.0274ZM109.091 247.21C108.381 247.21 107.784 247.035 107.299 246.685C106.813 246.33 106.445 245.852 106.193 245.25C105.945 244.643 105.822 243.964 105.822 243.213C105.822 242.452 105.945 241.771 106.193 241.169C106.445 240.567 106.813 240.093 107.299 239.748C107.789 239.403 108.388 239.23 109.098 239.23C109.798 239.23 110.4 239.405 110.904 239.755C111.412 240.1 111.802 240.574 112.073 241.176C112.343 241.778 112.479 242.457 112.479 243.213C112.479 243.969 112.343 244.648 112.073 245.25C111.802 245.852 111.412 246.33 110.904 246.685C110.4 247.035 109.795 247.21 109.091 247.21ZM105.612 250.36V239.44H106.725V245.005H106.865V250.36H105.612ZM108.937 246.069C109.436 246.069 109.849 245.943 110.176 245.691C110.502 245.439 110.747 245.098 110.911 244.669C111.074 244.235 111.156 243.75 111.156 243.213C111.156 242.681 111.074 242.2 110.911 241.771C110.752 241.342 110.505 241.001 110.169 240.749C109.837 240.497 109.415 240.371 108.902 240.371C108.412 240.371 108.006 240.492 107.684 240.735C107.362 240.973 107.121 241.307 106.963 241.736C106.804 242.161 106.725 242.653 106.725 243.213C106.725 243.764 106.802 244.256 106.956 244.69C107.114 245.119 107.357 245.458 107.684 245.705C108.01 245.948 108.428 246.069 108.937 246.069ZM116.883 247.196C116.398 247.196 115.98 247.119 115.63 246.965C115.285 246.811 114.998 246.606 114.769 246.349C114.541 246.092 114.361 245.808 114.23 245.495C114.1 245.182 114.006 244.863 113.95 244.536C113.899 244.209 113.873 243.904 113.873 243.619V239.44H115.133V243.227C115.133 243.582 115.166 243.925 115.231 244.256C115.297 244.587 115.406 244.886 115.56 245.152C115.719 245.418 115.929 245.628 116.19 245.782C116.456 245.936 116.788 246.013 117.184 246.013C117.497 246.013 117.782 245.959 118.038 245.852C118.295 245.745 118.514 245.586 118.696 245.376C118.878 245.161 119.018 244.891 119.116 244.564C119.214 244.237 119.263 243.857 119.263 243.423L120.082 243.675C120.082 244.403 119.949 245.031 119.683 245.558C119.422 246.085 119.051 246.491 118.57 246.776C118.094 247.056 117.532 247.196 116.883 247.196ZM119.403 247V244.977H119.263V239.44H120.516V247H119.403ZM126.697 247C126.249 247.089 125.806 247.124 125.367 247.105C124.933 247.091 124.546 247.005 124.205 246.846C123.864 246.683 123.605 246.431 123.428 246.09C123.279 245.791 123.197 245.49 123.183 245.187C123.174 244.879 123.169 244.531 123.169 244.144V237.34H124.415V244.088C124.415 244.396 124.417 244.66 124.422 244.879C124.431 245.098 124.48 245.287 124.569 245.446C124.737 245.745 125.003 245.92 125.367 245.971C125.736 246.022 126.179 246.008 126.697 245.929V247ZM121.636 240.469V239.44H126.697V240.469H121.636ZM131.194 247.21C130.452 247.21 129.803 247.047 129.248 246.72C128.697 246.389 128.268 245.929 127.96 245.341C127.652 244.748 127.498 244.058 127.498 243.269C127.498 242.443 127.649 241.729 127.953 241.127C128.256 240.52 128.678 240.054 129.22 239.727C129.766 239.396 130.405 239.23 131.138 239.23C131.898 239.23 132.545 239.405 133.077 239.755C133.613 240.105 134.015 240.604 134.281 241.253C134.551 241.902 134.668 242.674 134.631 243.57H133.371V243.122C133.357 242.193 133.168 241.5 132.804 241.043C132.44 240.581 131.898 240.35 131.18 240.35C130.41 240.35 129.824 240.597 129.423 241.092C129.021 241.587 128.821 242.296 128.821 243.22C128.821 244.111 129.021 244.802 129.423 245.292C129.824 245.782 130.396 246.027 131.138 246.027C131.637 246.027 132.071 245.913 132.44 245.684C132.808 245.455 133.098 245.126 133.308 244.697L134.505 245.11C134.211 245.777 133.767 246.295 133.175 246.664C132.587 247.028 131.926 247.21 131.194 247.21ZM128.401 243.57V242.569H133.987V243.57H128.401Z" fill="#5C6D8A"/>
<path d="M159.866 244.598C161.866 243.443 161.866 240.557 159.866 239.402L152 234.86V249.14L159.866 244.598Z" fill="url(#paint2_linear_393_4960)"/>
</g>
<g filter="url(#filter2_ddd_393_4960)">
<rect x="14" y="440" width="125" height="42" rx="10" fill="url(#paint3_linear_393_4960)"/>
<path d="M35.124 466.21C34.1207 466.21 33.269 465.988 32.569 465.545C31.869 465.102 31.3347 464.486 30.966 463.697C30.602 462.908 30.42 461.996 30.42 460.96C30.42 459.924 30.602 459.012 30.966 458.223C31.3347 457.434 31.869 456.818 32.569 456.375C33.269 455.932 34.1207 455.71 35.124 455.71C36.2907 455.71 37.2497 456.006 38.001 456.599C38.757 457.192 39.2773 457.99 39.562 458.993L38.295 459.329C38.0897 458.578 37.7233 457.985 37.196 457.551C36.6687 457.117 35.978 456.9 35.124 456.9C34.3727 456.9 33.7473 457.07 33.248 457.411C32.7487 457.752 32.373 458.228 32.121 458.839C31.869 459.446 31.7407 460.153 31.736 460.96C31.7313 461.763 31.855 462.47 32.107 463.081C32.359 463.688 32.737 464.164 33.241 464.509C33.745 464.85 34.3727 465.02 35.124 465.02C35.978 465.02 36.6687 464.803 37.196 464.369C37.7233 463.93 38.0897 463.338 38.295 462.591L39.562 462.927C39.2773 463.926 38.757 464.724 38.001 465.321C37.2497 465.914 36.2907 466.21 35.124 466.21ZM44.3172 466.21C43.5659 466.21 42.9172 466.04 42.3712 465.699C41.8299 465.358 41.4122 464.887 41.1182 464.285C40.8242 463.683 40.6772 462.992 40.6772 462.213C40.6772 461.42 40.8265 460.724 41.1252 460.127C41.4239 459.53 41.8462 459.065 42.3922 458.734C42.9382 458.398 43.5799 458.23 44.3172 458.23C45.0732 458.23 45.7242 458.4 46.2702 458.741C46.8162 459.077 47.2339 459.546 47.5232 460.148C47.8172 460.745 47.9642 461.434 47.9642 462.213C47.9642 463.002 47.8172 463.697 47.5232 464.299C47.2292 464.896 46.8092 465.365 46.2632 465.706C45.7172 466.042 45.0685 466.21 44.3172 466.21ZM44.3172 465.027C45.1012 465.027 45.6845 464.766 46.0672 464.243C46.4499 463.72 46.6412 463.044 46.6412 462.213C46.6412 461.359 46.4475 460.68 46.0602 460.176C45.6729 459.667 45.0919 459.413 44.3172 459.413C43.7899 459.413 43.3559 459.532 43.0152 459.77C42.6745 460.008 42.4202 460.337 42.2522 460.757C42.0842 461.177 42.0002 461.662 42.0002 462.213C42.0002 463.062 42.1962 463.744 42.5882 464.257C42.9802 464.77 43.5565 465.027 44.3172 465.027ZM58.5424 466L58.5494 461.163C58.5494 460.598 58.3977 460.157 58.0944 459.84C57.7957 459.518 57.4061 459.357 56.9254 459.357C56.6454 459.357 56.3794 459.422 56.1274 459.553C55.8754 459.679 55.6701 459.88 55.5114 460.155C55.3527 460.426 55.2734 460.773 55.2734 461.198L54.6154 460.932C54.6061 460.395 54.7157 459.926 54.9444 459.525C55.1777 459.119 55.4951 458.804 55.8964 458.58C56.2977 458.356 56.7504 458.244 57.2544 458.244C58.0431 458.244 58.6637 458.484 59.1164 458.965C59.5691 459.441 59.7954 460.083 59.7954 460.89L59.7884 466H58.5424ZM49.4984 466V458.44H50.6114V460.463H50.7514V466H49.4984ZM54.0274 466L54.0344 461.212C54.0344 460.633 53.8851 460.181 53.5864 459.854C53.2877 459.523 52.8911 459.357 52.3964 459.357C51.9064 459.357 51.5097 459.525 51.2064 459.861C50.9031 460.197 50.7514 460.643 50.7514 461.198L50.0934 460.806C50.0934 460.316 50.2101 459.877 50.4434 459.49C50.6767 459.103 50.9941 458.799 51.3954 458.58C51.7967 458.356 52.2517 458.244 52.7604 458.244C53.2691 458.244 53.7124 458.351 54.0904 458.566C54.4684 458.781 54.7601 459.089 54.9654 459.49C55.1707 459.887 55.2734 460.36 55.2734 460.911L55.2664 466H54.0274ZM70.6557 466L70.6627 461.163C70.6627 460.598 70.511 460.157 70.2077 459.84C69.909 459.518 69.5193 459.357 69.0387 459.357C68.7587 459.357 68.4927 459.422 68.2407 459.553C67.9887 459.679 67.7833 459.88 67.6247 460.155C67.466 460.426 67.3867 460.773 67.3867 461.198L66.7287 460.932C66.7193 460.395 66.829 459.926 67.0577 459.525C67.291 459.119 67.6083 458.804 68.0097 458.58C68.411 458.356 68.8637 458.244 69.3677 458.244C70.1563 458.244 70.777 458.484 71.2297 458.965C71.6823 459.441 71.9087 460.083 71.9087 460.89L71.9017 466H70.6557ZM61.6117 466V458.44H62.7247V460.463H62.8647V466H61.6117ZM66.1407 466L66.1477 461.212C66.1477 460.633 65.9983 460.181 65.6997 459.854C65.401 459.523 65.0043 459.357 64.5097 459.357C64.0197 459.357 63.623 459.525 63.3197 459.861C63.0163 460.197 62.8647 460.643 62.8647 461.198L62.2067 460.806C62.2067 460.316 62.3233 459.877 62.5567 459.49C62.79 459.103 63.1073 458.799 63.5087 458.58C63.91 458.356 64.365 458.244 64.8737 458.244C65.3823 458.244 65.8257 458.351 66.2037 458.566C66.5817 458.781 66.8733 459.089 67.0787 459.49C67.284 459.887 67.3867 460.36 67.3867 460.911L67.3797 466H66.1407ZM76.602 466.196C76.1166 466.196 75.699 466.119 75.349 465.965C75.0036 465.811 74.7166 465.606 74.488 465.349C74.2593 465.092 74.0796 464.808 73.949 464.495C73.8183 464.182 73.725 463.863 73.669 463.536C73.6176 463.209 73.592 462.904 73.592 462.619V458.44H74.852V462.227C74.852 462.582 74.8846 462.925 74.95 463.256C75.0153 463.587 75.125 463.886 75.279 464.152C75.4376 464.418 75.6476 464.628 75.909 464.782C76.175 464.936 76.5063 465.013 76.903 465.013C77.2156 465.013 77.5003 464.959 77.757 464.852C78.0136 464.745 78.233 464.586 78.415 464.376C78.597 464.161 78.737 463.891 78.835 463.564C78.933 463.237 78.982 462.857 78.982 462.423L79.801 462.675C79.801 463.403 79.668 464.031 79.402 464.558C79.1406 465.085 78.7696 465.491 78.289 465.776C77.813 466.056 77.2506 466.196 76.602 466.196ZM79.122 466V463.977H78.982V458.44H80.235V466H79.122ZM87.5778 466V462.213C87.5778 461.854 87.5452 461.508 87.4798 461.177C87.4192 460.846 87.3095 460.549 87.1508 460.288C86.9968 460.022 86.7868 459.812 86.5208 459.658C86.2595 459.504 85.9282 459.427 85.5268 459.427C85.2142 459.427 84.9295 459.481 84.6728 459.588C84.4208 459.691 84.2038 459.849 84.0218 460.064C83.8398 460.279 83.6975 460.549 83.5948 460.876C83.4968 461.198 83.4478 461.578 83.4478 462.017L82.6288 461.765C82.6288 461.032 82.7595 460.405 83.0208 459.882C83.2868 459.355 83.6578 458.951 84.1338 458.671C84.6145 458.386 85.1792 458.244 85.8278 458.244C86.3178 458.244 86.7355 458.321 87.0808 458.475C87.4262 458.629 87.7132 458.834 87.9418 459.091C88.1705 459.343 88.3502 459.628 88.4808 459.945C88.6115 460.258 88.7025 460.577 88.7538 460.904C88.8098 461.226 88.8378 461.532 88.8378 461.821V466H87.5778ZM82.1878 466V458.44H83.3078V460.463H83.4478V466H82.1878ZM90.7977 457.103V455.815H92.0437V457.103H90.7977ZM90.7977 466V458.44H92.0437V466H90.7977ZM97.3291 466.21C96.5637 466.21 95.9127 466.04 95.3761 465.699C94.8441 465.354 94.4381 464.88 94.1581 464.278C93.8781 463.676 93.7334 462.99 93.7241 462.22C93.7334 461.431 93.8804 460.738 94.1651 460.141C94.4544 459.539 94.8674 459.07 95.4041 458.734C95.9407 458.398 96.5871 458.23 97.3431 458.23C98.1411 458.23 98.8271 458.426 99.4011 458.818C99.9797 459.21 100.367 459.747 100.563 460.428L99.3311 460.799C99.1724 460.36 98.9134 460.02 98.5541 459.777C98.1994 459.534 97.7911 459.413 97.3291 459.413C96.8111 459.413 96.3841 459.534 96.0481 459.777C95.7121 460.015 95.4624 460.346 95.2991 460.771C95.1357 461.191 95.0517 461.674 95.0471 462.22C95.0564 463.06 95.2501 463.739 95.6281 464.257C96.0107 464.77 96.5777 465.027 97.3291 465.027C97.8237 465.027 98.2344 464.915 98.5611 464.691C98.8877 464.462 99.1351 464.133 99.3031 463.704L100.563 464.033C100.302 464.738 99.8934 465.277 99.3381 465.65C98.7827 466.023 98.1131 466.21 97.3291 466.21ZM104.072 466.21C103.508 466.21 103.034 466.107 102.651 465.902C102.273 465.692 101.986 465.417 101.79 465.076C101.599 464.735 101.503 464.362 101.503 463.956C101.503 463.559 101.578 463.216 101.727 462.927C101.881 462.633 102.096 462.39 102.371 462.199C102.647 462.003 102.976 461.849 103.358 461.737C103.718 461.639 104.119 461.555 104.562 461.485C105.01 461.41 105.463 461.343 105.92 461.282C106.378 461.221 106.805 461.163 107.201 461.107L106.753 461.366C106.767 460.694 106.632 460.197 106.347 459.875C106.067 459.553 105.582 459.392 104.891 459.392C104.434 459.392 104.033 459.497 103.687 459.707C103.347 459.912 103.106 460.248 102.966 460.715L101.783 460.358C101.965 459.695 102.318 459.175 102.84 458.797C103.363 458.419 104.051 458.23 104.905 458.23C105.591 458.23 106.179 458.354 106.669 458.601C107.164 458.844 107.519 459.212 107.733 459.707C107.841 459.94 107.908 460.195 107.936 460.47C107.964 460.741 107.978 461.025 107.978 461.324V466H106.872V464.187L107.131 464.355C106.847 464.966 106.448 465.428 105.934 465.741C105.426 466.054 104.805 466.21 104.072 466.21ZM104.261 465.167C104.709 465.167 105.097 465.088 105.423 464.929C105.755 464.766 106.021 464.553 106.221 464.292C106.422 464.026 106.553 463.737 106.613 463.424C106.683 463.191 106.721 462.932 106.725 462.647C106.735 462.358 106.739 462.136 106.739 461.982L107.173 462.171C106.767 462.227 106.368 462.281 105.976 462.332C105.584 462.383 105.213 462.439 104.863 462.5C104.513 462.556 104.198 462.624 103.918 462.703C103.713 462.768 103.519 462.852 103.337 462.955C103.16 463.058 103.015 463.191 102.903 463.354C102.796 463.513 102.742 463.711 102.742 463.949C102.742 464.154 102.794 464.35 102.896 464.537C103.004 464.724 103.167 464.875 103.386 464.992C103.61 465.109 103.902 465.167 104.261 465.167ZM114.019 466C113.571 466.089 113.128 466.124 112.689 466.105C112.255 466.091 111.868 466.005 111.527 465.846C111.187 465.683 110.928 465.431 110.75 465.09C110.601 464.791 110.519 464.49 110.505 464.187C110.496 463.879 110.491 463.531 110.491 463.144V456.34H111.737V463.088C111.737 463.396 111.74 463.66 111.744 463.879C111.754 464.098 111.803 464.287 111.891 464.446C112.059 464.745 112.325 464.92 112.689 464.971C113.058 465.022 113.501 465.008 114.019 464.929V466ZM108.958 459.469V458.44H114.019V459.469H108.958ZM118.516 466.21C117.774 466.21 117.125 466.047 116.57 465.72C116.019 465.389 115.59 464.929 115.282 464.341C114.974 463.748 114.82 463.058 114.82 462.269C114.82 461.443 114.971 460.729 115.275 460.127C115.578 459.52 116 459.054 116.542 458.727C117.088 458.396 117.727 458.23 118.46 458.23C119.22 458.23 119.867 458.405 120.399 458.755C120.935 459.105 121.337 459.604 121.603 460.253C121.873 460.902 121.99 461.674 121.953 462.57H120.693V462.122C120.679 461.193 120.49 460.5 120.126 460.043C119.762 459.581 119.22 459.35 118.502 459.35C117.732 459.35 117.146 459.597 116.745 460.092C116.343 460.587 116.143 461.296 116.143 462.22C116.143 463.111 116.343 463.802 116.745 464.292C117.146 464.782 117.718 465.027 118.46 465.027C118.959 465.027 119.393 464.913 119.762 464.684C120.13 464.455 120.42 464.126 120.63 463.697L121.827 464.11C121.533 464.777 121.089 465.295 120.497 465.664C119.909 466.028 119.248 466.21 118.516 466.21ZM115.723 462.57V461.569H121.309V462.57H115.723Z" fill="#5C6D8A"/>
<path d="M146.866 463.598C148.866 462.443 148.866 459.557 146.866 458.402L139 453.86V468.14L146.866 463.598Z" fill="url(#paint4_linear_393_4960)"/>
</g>
<defs>
<filter id="filter0_ddd_393_4960" x="61" y="0" width="119.366" height="70" filterUnits="userSpaceOnUse" color-interpolation-filters="sRGB">
<feFlood flood-opacity="0" result="BackgroundImageFix"/>
<feColorMatrix in="SourceAlpha" type="matrix" values="0 0 0 0 0 0 0 0 0 0 0 0 0 0 0 0 0 0 127 0" result="hardAlpha"/>
<feOffset dy="5"/>
<feGaussianBlur stdDeviation="7"/>
<feColorMatrix type="matrix" values="0 0 0 0 0.0323264 0 0 0 0 0.0598209 0 0 0 0 0.204167 0 0 0 0.04 0"/>
<feBlend mode="normal" in2="BackgroundImageFix" result="effect1_dropShadow_393_4960"/>
<feColorMatrix in="SourceAlpha" type="matrix" values="0 0 0 0 0 0 0 0 0 0 0 0 0 0 0 0 0 0 127 0" result="hardAlpha"/>
<feOffset dy="1"/>
<feGaussianBlur stdDeviation="0.5"/>
<feComposite in2="hardAlpha" operator="out"/>
<feColorMatrix type="matrix" values="0 0 0 0 0.090196 0 0 0 0 0.0588235 0 0 0 0 0.286275 0 0 0 0.04 0"/>
<feBlend mode="normal" in2="effect1_dropShadow_393_4960" result="effect2_dropShadow_393_4960"/>
<feColorMatrix in="SourceAlpha" type="matrix" values="0 0 0 0 0 0 0 0 0 0 0 0 0 0 0 0 0 0 127 0" result="hardAlpha"/>
<feOffset/>
<feGaussianBlur stdDeviation="0.5"/>
<feComposite in2="hardAlpha" operator="out"/>
<feColorMatrix type="matrix" values="0 0 0 0 0.090196 0 0 0 0 0.0588235 0 0 0 0 0.286275 0 0 0 0.03 0"/>
<feBlend mode="normal" in2="effect2_dropShadow_393_4960" result="effect3_dropShadow_393_4960"/>
<feBlend mode="normal" in="SourceGraphic" in2="effect3_dropShadow_393_4960" result="shape"/>
</filter>
<filter id="filter1_ddd_393_4960" x="44" y="212" width="134.366" height="70" filterUnits="userSpaceOnUse" color-interpolation-filters="sRGB">
<feFlood flood-opacity="0" result="BackgroundImageFix"/>
<feColorMatrix in="SourceAlpha" type="matrix" values="0 0 0 0 0 0 0 0 0 0 0 0 0 0 0 0 0 0 127 0" result="hardAlpha"/>
<feOffset dy="5"/>
<feGaussianBlur stdDeviation="7"/>
<feColorMatrix type="matrix" values="0 0 0 0 0.0323264 0 0 0 0 0.0598209 0 0 0 0 0.204167 0 0 0 0.04 0"/>
<feBlend mode="normal" in2="BackgroundImageFix" result="effect1_dropShadow_393_4960"/>
<feColorMatrix in="SourceAlpha" type="matrix" values="0 0 0 0 0 0 0 0 0 0 0 0 0 0 0 0 0 0 127 0" result="hardAlpha"/>
<feOffset dy="1"/>
<feGaussianBlur stdDeviation="0.5"/>
<feComposite in2="hardAlpha" operator="out"/>
<feColorMatrix type="matrix" values="0 0 0 0 0.090196 0 0 0 0 0.0588235 0 0 0 0 0.286275 0 0 0 0.04 0"/>
<feBlend mode="normal" in2="effect1_dropShadow_393_4960" result="effect2_dropShadow_393_4960"/>
<feColorMatrix in="SourceAlpha" type="matrix" values="0 0 0 0 0 0 0 0 0 0 0 0 0 0 0 0 0 0 127 0" result="hardAlpha"/>
<feOffset/>
<feGaussianBlur stdDeviation="0.5"/>
<feComposite in2="hardAlpha" operator="out"/>
<feColorMatrix type="matrix" values="0 0 0 0 0.090196 0 0 0 0 0.0588235 0 0 0 0 0.286275 0 0 0 0.03 0"/>
<feBlend mode="normal" in2="effect2_dropShadow_393_4960" result="effect3_dropShadow_393_4960"/>
<feBlend mode="normal" in="SourceGraphic" in2="effect3_dropShadow_393_4960" result="shape"/>
</filter>
<filter id="filter2_ddd_393_4960" x="0" y="431" width="165.366" height="70" filterUnits="userSpaceOnUse" color-interpolation-filters="sRGB">
<feFlood flood-opacity="0" result="BackgroundImageFix"/>
<feColorMatrix in="SourceAlpha" type="matrix" values="0 0 0 0 0 0 0 0 0 0 0 0 0 0 0 0 0 0 127 0" result="hardAlpha"/>
<feOffset dy="5"/>
<feGaussianBlur stdDeviation="7"/>
<feColorMatrix type="matrix" values="0 0 0 0 0.0323264 0 0 0 0 0.0598209 0 0 0 0 0.204167 0 0 0 0.04 0"/>
<feBlend mode="normal" in2="BackgroundImageFix" result="effect1_dropShadow_393_4960"/>
<feColorMatrix in="SourceAlpha" type="matrix" values="0 0 0 0 0 0 0 0 0 0 0 0 0 0 0 0 0 0 127 0" result="hardAlpha"/>
<feOffset dy="1"/>
<feGaussianBlur stdDeviation="0.5"/>
<feComposite in2="hardAlpha" operator="out"/>
<feColorMatrix type="matrix" values="0 0 0 0 0.090196 0 0 0 0 0.0588235 0 0 0 0 0.286275 0 0 0 0.04 0"/>
<feBlend mode="normal" in2="effect1_dropShadow_393_4960" result="effect2_dropShadow_393_4960"/>
<feColorMatrix in="SourceAlpha" type="matrix" values="0 0 0 0 0 0 0 0 0 0 0 0 0 0 0 0 0 0 127 0" result="hardAlpha"/>
<feOffset/>
<feGaussianBlur stdDeviation="0.5"/>
<feComposite in2="hardAlpha" operator="out"/>
<feColorMatrix type="matrix" values="0 0 0 0 0.090196 0 0 0 0 0.0588235 0 0 0 0 0.286275 0 0 0 0.03 0"/>
<feBlend mode="normal" in2="effect2_dropShadow_393_4960" result="effect3_dropShadow_393_4960"/>
<feBlend mode="normal" in="SourceGraphic" in2="effect3_dropShadow_393_4960" result="shape"/>
</filter>
<linearGradient id="paint0_linear_393_4960" x1="115" y1="53.5" x2="108.326" y2="10.4214" gradientUnits="userSpaceOnUse">
<stop stop-color="#1C71FF"/>
</linearGradient>
<linearGradient id="paint1_linear_393_4960" x1="105" y1="229.116" x2="105" y2="268.732" gradientUnits="userSpaceOnUse">
<stop stop-color="#F0F5FF"/>
<stop offset="1" stop-color="white"/>
</linearGradient>
<linearGradient id="paint2_linear_393_4960" x1="161.976" y1="242" x2="150.312" y2="242" gradientUnits="userSpaceOnUse">
<stop stop-color="#F0F5FF"/>
<stop offset="1" stop-color="white"/>
</linearGradient>
<linearGradient id="paint3_linear_393_4960" x1="76.5" y1="448.116" x2="76.5" y2="487.732" gradientUnits="userSpaceOnUse">
<stop stop-color="#F0F5FF"/>
<stop offset="1" stop-color="white"/>
</linearGradient>
<linearGradient id="paint4_linear_393_4960" x1="148.976" y1="461" x2="137.312" y2="461" gradientUnits="userSpaceOnUse">
<stop stop-color="#F0F5FF"/>
<stop offset="1" stop-color="white"/>
</linearGradient>
</defs>
</svg>
