<svg width="857" height="652" viewBox="0 0 857 652" fill="none" xmlns="http://www.w3.org/2000/svg">
<path fill-rule="evenodd" clip-rule="evenodd" d="M121.21 1.03299C77.2278 50.2904 32.8242 100.019 115.641 241.295C151.887 303.127 136 355 89.7612 406.504C5.09534 500.811 -15.2739 590.168 11.3594 652H152H228H857V0H228H152H122.133C121.825 0.344326 121.518 0.688644 121.21 1.03299Z" fill="#FAFCFF"/>
</svg>
