<svg width="96" height="24" viewBox="0 0 96 24" fill="none" xmlns="http://www.w3.org/2000/svg">
<path fill-rule="evenodd" clip-rule="evenodd" d="M59.5974 0.0229736C59.2918 0.0850404 59.0231 0.253598 58.9089 0.4549C58.8571 0.546139 58.8526 0.820614 58.8379 4.81489L58.8222 9.0775L58.6661 8.85484C58.3197 8.36045 57.6492 7.82082 57.031 7.53872C55.9567 7.04854 54.4344 7.0959 53.3241 7.65405C52.0711 8.28392 51.0282 9.55077 50.7128 10.8261C50.5726 11.393 50.5687 11.4507 50.5533 13.1947C50.5375 14.9739 50.5553 15.3837 50.6707 15.8896C50.8595 16.7171 51.2432 17.4446 51.8723 18.168C52.4607 18.8446 53.2023 19.347 53.9847 19.5991C54.7681 19.8514 55.8232 19.8468 56.6273 19.5876C57.4998 19.3064 58.3315 18.7207 58.7916 18.0634L58.926 17.8714L58.9369 18.4265C58.9475 18.9662 58.9502 18.9856 59.0327 19.1207C59.3907 19.7074 60.4624 19.7455 60.939 19.1885C60.9926 19.1258 61.0486 19.0127 61.0671 18.9296C61.1148 18.7154 61.1129 0.810082 61.0652 0.595677C61.0178 0.383028 60.8121 0.178337 60.5501 0.083255C60.3384 0.00639013 59.8358 -0.025415 59.5974 0.0229736ZM15.9688 0.314243C14.771 1.30289 13.342 1.94 11.6646 2.23323C9.7159 2.57389 7.57687 2.4651 5.16119 1.90247C4.64497 1.78224 3.53464 1.47672 3.40181 1.41834C3.36725 1.40315 3.16225 1.33264 2.94626 1.26162C2.73026 1.19059 2.48992 1.10631 2.41216 1.07433L2.27078 1.01613L2.11879 1.17761C1.99541 1.30867 1.81668 1.51869 1.56939 1.82328C1.54627 1.85175 1.29408 2.22676 1.19807 2.37546C1.08635 2.54844 0.863595 2.97982 0.746346 3.25024C0.675279 3.41411 0.60393 3.57543 0.587782 3.60872C0.540844 3.70547 0.345773 4.31721 0.295254 4.52595C0.260601 4.66918 0.258276 4.71999 0.285986 4.72922C0.355638 4.75249 0.857281 4.8355 1.37539 4.90952C1.6605 4.95028 1.9786 4.99777 2.08228 5.01511C2.64456 5.10904 3.94916 5.1997 5.01981 5.21922C6.26488 5.24192 7.4666 5.15449 8.64852 4.95525C10.5832 4.62909 12.3526 3.93957 13.6439 3.00851C14.4478 2.42894 15.1534 1.69675 15.6467 0.930554C15.727 0.805724 15.8145 0.676355 15.8411 0.643067L15.8894 0.582544L15.8659 0.643067C15.8004 0.811656 15.4879 1.32477 15.2669 1.62657C14.8321 2.2204 14.1627 2.90075 13.6144 3.3061C13.5469 3.35603 13.4481 3.43154 13.3949 3.47387C13.3418 3.51621 13.263 3.57359 13.2198 3.60134C13.1766 3.62912 13.0564 3.70873 12.9527 3.77828C12.3933 4.15355 11.3277 4.694 10.5759 4.98375C10.3573 5.068 10.1686 5.13694 10.1565 5.13694C10.1445 5.13694 10.0901 5.15582 10.0356 5.17891C9.61615 5.35673 8.20029 5.7324 7.45466 5.86374C7.26458 5.89721 7.05252 5.93812 6.9834 5.95461C6.62389 6.04052 5.14749 6.20482 4.28829 6.25454C3.28019 6.31288 0.717253 6.28619 0.145519 6.21138L0.0309392 6.1964L0.00888413 6.62748C-0.0302306 7.3908 0.0619481 8.52405 0.243321 9.50976C0.322839 9.94202 0.556427 10.8903 0.592934 10.9293C0.639432 10.9789 2.17417 10.7582 3.22901 10.5503C10.0664 9.20261 14.7578 6.05012 15.8124 2.09454C15.9071 1.73918 15.9523 1.49354 16.0462 0.824638C16.0716 0.643703 16.0742 0.67457 16.0637 1.03647C16.0277 2.2762 15.5306 3.70628 14.7118 4.92547C14.5253 5.20321 14.1677 5.689 14.0327 5.84809C13.5727 6.3899 12.7596 7.19949 12.2458 7.62721C10.5203 9.06367 8.32401 10.3066 5.71099 11.3253C5.44017 11.4309 4.67905 11.7037 4.6553 11.7037C4.645 11.7037 4.59203 11.7226 4.53758 11.7456C4.13632 11.9151 1.97345 12.5415 1.42751 12.6463C1.32656 12.6657 1.23737 12.6981 1.22929 12.7184C1.20055 12.7906 1.69883 13.9009 2.15146 14.7733C2.49953 15.4442 2.73881 15.8662 3.10495 16.4548C3.27576 16.7295 3.7736 17.4996 3.7967 17.525C3.85309 17.5869 5.95168 16.5301 7.15619 15.8332C11.1266 13.536 14.2086 10.6014 15.719 7.67992C16.4574 6.25154 16.784 5.07399 16.823 3.69951C16.8503 2.73558 16.7431 2.04491 16.426 1.14239C16.2181 0.550739 16.2219 0.56472 16.3114 0.718722C16.3549 0.79362 16.4609 1.02512 16.5469 1.23317C17.8051 4.27681 16.8063 8.20597 13.7889 12.082C11.8635 14.5555 9.30989 16.8091 6.13513 18.8367C5.68586 19.1236 5.29292 19.3757 5.26194 19.397C5.21045 19.4323 5.24042 19.4771 5.61143 19.9198C6.18386 20.6028 6.79854 21.2887 7.37087 21.8832C7.8667 22.3982 8.92877 23.413 9.37065 23.7939L9.60961 23.9999L9.74172 23.8798C11.4549 22.3227 12.3969 21.3547 13.5807 19.9349C16.6262 16.2826 18.5433 12.3864 19.0604 8.79861C19.2372 7.57171 19.2266 6.34826 19.0295 5.23084C18.7614 3.71119 18.1003 2.3278 17.1518 1.3015C16.9638 1.09805 16.0713 0.2237 16.0637 0.235502C16.0637 0.235502 16.0206 0.271453 15.9688 0.314243ZM35.8717 1.60942C35.2208 1.78418 34.7969 2.36902 34.8952 2.95688C34.9384 3.21535 35.0393 3.39674 35.2596 3.61211C35.5593 3.90504 35.8408 4.01659 36.2802 4.01659C36.7077 4.01659 36.9843 3.90695 37.2754 3.62213C37.9692 2.94323 37.6311 1.86086 36.6462 1.60827C36.4484 1.55755 36.0628 1.55812 35.8717 1.60942ZM43.6349 7.24089C42.183 7.41865 41.2491 7.95506 40.6053 8.98121C40.2089 9.61283 40.0228 10.4329 40.1061 11.1798C40.1563 11.6291 40.2187 11.8495 40.3961 12.2031C40.6291 12.6675 40.9741 13.0287 41.4955 13.354C41.9291 13.6246 42.3475 13.7746 43.9774 14.2435C44.9114 14.5123 45.2822 14.6617 45.7368 14.9525C46.2702 15.2937 46.5416 15.7053 46.5995 16.2608C46.6704 16.9408 46.2595 17.5556 45.5529 17.8267C44.9964 18.0402 43.7673 18.1016 43.0428 17.9521C42.4784 17.8356 41.7046 17.5037 41.2284 17.1739C40.8194 16.8907 40.702 16.8389 40.5054 16.8546C40.2846 16.8722 40.1304 16.9717 39.9825 17.192C39.4923 17.9227 39.856 18.5841 41.0713 19.1723C41.6952 19.4742 42.4501 19.6736 43.2753 19.7546C43.7456 19.8006 44.9691 19.7766 45.3757 19.7133C45.7031 19.6623 46.2504 19.5151 46.5317 19.4025C47.4439 19.0369 48.1282 18.3779 48.4373 17.567C48.6551 16.9956 48.7067 16.2464 48.5763 15.5483C48.42 14.7117 47.961 14.0319 47.1943 13.5016C46.7666 13.2059 46.0786 12.952 44.7393 12.5958C43.8361 12.3555 43.5592 12.2621 43.1048 12.0443C42.6363 11.8199 42.3917 11.6089 42.2265 11.2871C42.1115 11.0628 42.1082 11.0472 42.1103 10.7369C42.1122 10.4657 42.1253 10.3863 42.1968 10.2095C42.3441 9.84564 42.6799 9.45762 43.0073 9.27281C43.3999 9.05115 44.0125 8.93388 44.6372 8.96078C45.3408 8.99108 45.6143 9.05656 46.5851 9.42724C47.3269 9.71046 47.4485 9.73173 47.679 9.61849C48.0009 9.46028 48.3243 8.84948 48.2613 8.51863C48.2285 8.34629 48.0955 8.16466 47.9012 8.02691C47.4324 7.69448 46.4664 7.37604 45.5999 7.26834C45.0525 7.20028 44.0777 7.18666 43.6349 7.24089ZM82.7937 7.23771C82.1205 7.33458 81.6841 7.49139 81.16 7.82485C80.7828 8.06479 80.2463 8.5685 80.0435 8.87306L79.9033 9.08368L79.8874 8.50991C79.8699 7.87493 79.8502 7.79737 79.6635 7.6286C79.4339 7.42095 79.098 7.32589 78.7045 7.35718C78.4132 7.38033 78.1694 7.46991 77.9949 7.61783C77.7281 7.84413 77.7496 7.30526 77.7588 13.5086L77.7669 19.0171L77.8611 19.1485C77.9775 19.3107 78.2622 19.4923 78.4817 19.5444C78.7087 19.5982 79.0499 19.5914 79.2731 19.5285C79.6264 19.429 79.9199 19.1708 79.9784 18.9081C80.0027 18.7988 80.0132 17.7007 80.0132 15.262C80.0132 11.5316 80.0125 11.5528 80.1693 11.0758C80.5165 10.0196 81.5485 9.23801 82.6837 9.17159C83.4261 9.12816 84.1017 9.36977 84.6649 9.88011C85.1627 10.3312 85.4746 10.9221 85.5724 11.5999C85.5941 11.7498 85.6055 13.0498 85.6055 15.3542C85.6055 17.9257 85.6154 18.9169 85.642 19.0185C85.7422 19.4022 86.3445 19.6554 86.9576 19.5716C87.3755 19.5145 87.6241 19.3852 87.7675 19.1503L87.8519 19.012L87.869 15.2746C87.8876 11.2238 87.876 11.4903 88.0548 10.9946C88.2994 10.3162 88.913 9.69442 89.646 9.38209C89.9584 9.24894 90.1923 9.19404 90.5381 9.17262C91.2754 9.12695 91.9967 9.38321 92.5603 9.89109C92.9774 10.267 93.2227 10.6687 93.39 11.2498L93.4728 11.5373L93.4899 15.2444L93.507 18.9514L93.594 19.0939C93.7017 19.2703 93.9771 19.4656 94.2126 19.5324C94.4354 19.5956 94.8091 19.5956 95.0316 19.5325C95.2697 19.465 95.5266 19.285 95.6423 19.1047L95.7377 18.9562L95.7472 15.5342C95.7571 11.9573 95.7448 11.4938 95.6239 10.8903C95.4388 9.96593 94.9967 9.13506 94.3619 8.51863C93.5508 7.73101 92.7111 7.33255 91.6392 7.2266C91.204 7.18357 90.925 7.18675 90.5695 7.23877C89.1545 7.44576 87.9066 8.31672 87.1856 9.60055C87.1295 9.70041 87.0833 9.76375 87.0829 9.7413C87.0817 9.67145 86.8015 9.15879 86.6214 8.8969C86.188 8.26649 85.4304 7.67185 84.7416 7.42146C84.2004 7.22476 83.4051 7.14971 82.7937 7.23771ZM23.1734 7.37401C22.9414 7.44549 22.5943 7.62866 22.4616 7.74971C22.251 7.94181 22.1836 8.1616 22.2547 8.42455C22.2984 8.58611 26.6522 19.2457 26.7479 19.4253C26.8822 19.6775 27.2458 19.8144 27.7772 19.8129C28.2665 19.8115 28.5682 19.7028 28.7328 19.4686C28.769 19.4172 29.7823 16.9716 30.9847 14.0339C32.1871 11.0962 33.1922 8.64727 33.2183 8.59177C33.2443 8.53627 33.2742 8.41156 33.2847 8.31461C33.319 7.99901 33.1334 7.75579 32.6951 7.54175C32.3599 7.37804 32.1314 7.31579 31.8658 7.31579C31.5119 7.31579 31.3008 7.43756 31.1507 7.72828C31.1089 7.80933 30.3349 9.79232 29.4307 12.135C28.5265 14.4776 27.7785 16.394 27.7685 16.3936C27.7585 16.3933 26.9869 14.4221 26.0538 12.0133C24.7239 8.5803 24.3369 7.61135 24.2633 7.53049C24.1157 7.36856 23.963 7.31697 23.6346 7.31809C23.4503 7.31869 23.2897 7.33818 23.1734 7.37401ZM35.8906 7.39226C35.6822 7.4431 35.5284 7.5232 35.3745 7.66098C35.166 7.84758 35.1806 7.4119 35.1806 13.4718V18.985L35.2743 19.1273C35.6283 19.6651 36.6025 19.7467 37.1531 19.2848C37.2271 19.2227 37.3155 19.1194 37.3494 19.0553C37.4102 18.9407 37.4112 18.8469 37.4112 13.4498V7.96081L37.3381 7.82742C37.2485 7.66395 37.0638 7.52378 36.8231 7.43671C36.585 7.35056 36.147 7.32968 35.8906 7.39226ZM64.9055 7.3918C64.6665 7.45647 64.5461 7.51678 64.3878 7.65096C64.1082 7.88807 64.1317 7.52329 64.1317 11.613C64.1317 15.428 64.1315 15.4223 64.277 15.9858C64.469 16.7296 64.8436 17.4021 65.4107 18.0213C66.2957 18.9877 67.4508 19.595 68.7001 19.7507C69.04 19.7931 69.8428 19.793 70.1824 19.7506C71.0268 19.6452 71.8843 19.3085 72.5516 18.8203C73.5789 18.0686 74.3038 17.0607 74.5744 16.0074C74.7202 15.4402 74.7194 15.4629 74.7194 11.5978V7.93615L74.6464 7.8151C74.3179 7.27067 73.2265 7.1876 72.7144 7.66803C72.4688 7.89851 72.4907 7.53918 72.4717 11.6432L72.4547 15.32L72.3828 15.5621C72.1595 16.315 71.6453 16.9796 70.9419 17.425C70.7063 17.5741 70.4369 17.6845 70.0853 17.7757C69.8393 17.8396 69.2017 17.8467 68.8915 17.7889C67.7744 17.5811 66.78 16.6482 66.4661 15.5135L66.3958 15.2595L66.3791 11.6107L66.3624 7.96196L66.2764 7.83689C66.1749 7.68913 65.9167 7.4976 65.7183 7.42288C65.524 7.34971 65.1184 7.33419 64.9055 7.3918ZM56.5601 9.24994C57.0665 9.37592 57.6912 9.74066 58.0546 10.1225C58.3904 10.4754 58.6195 10.8928 58.7519 11.3928C58.8212 11.6547 58.8222 11.686 58.8222 13.6859V15.7134L58.7486 15.8891C58.5171 16.4416 57.7541 17.2036 57.1099 17.5255C56.8076 17.6766 56.5385 17.7559 56.1485 17.8088C55.8311 17.8519 55.7687 17.8518 55.4536 17.808C55.0734 17.7552 54.7244 17.6397 54.4202 17.4661C53.7525 17.085 53.1531 16.3414 52.91 15.5924L52.8216 15.32L52.8215 13.4892L52.8214 11.6583L52.908 11.3926C53.0886 10.8382 53.409 10.3573 53.8804 9.93343C54.3074 9.54944 54.7377 9.33052 55.3034 9.2096C55.604 9.14532 56.2191 9.16508 56.5601 9.24994Z" fill="#70809C"/>
<path fill-rule="evenodd" clip-rule="evenodd" d="M15.9688 0.315188C14.771 1.30384 13.342 1.94094 11.6646 2.23418C9.7159 2.57483 7.57687 2.46604 5.16119 1.90342C4.64497 1.78319 3.53464 1.47766 3.40181 1.41929C3.36725 1.4041 3.16225 1.33359 2.94626 1.26256C2.73026 1.19154 2.48992 1.10726 2.41216 1.07527L2.27078 1.01708L2.11879 1.17856C1.99541 1.30962 1.81668 1.51964 1.56939 1.82422C1.54627 1.8527 1.29408 2.2277 1.19807 2.37641C1.08635 2.54938 0.863595 2.98077 0.746346 3.25118C0.675279 3.41505 0.60393 3.57638 0.587782 3.60966C0.540844 3.70641 0.345773 4.31815 0.295254 4.5269C0.260601 4.67013 0.258276 4.72094 0.285986 4.73017C0.355638 4.75344 0.857281 4.83645 1.37539 4.91047C1.6605 4.95123 1.9786 4.99871 2.08228 5.01605C2.64456 5.10998 3.94916 5.20065 5.01981 5.22017C6.26488 5.24286 7.4666 5.15544 8.64852 4.95619C10.5832 4.63003 12.3526 3.94052 13.6439 3.00945C14.4478 2.42988 15.1534 1.6977 15.6467 0.931499C15.727 0.806669 15.8145 0.6773 15.8411 0.644012L15.8894 0.583488L15.8659 0.644012C15.8004 0.8126 15.4879 1.32572 15.2669 1.62752C14.8321 2.22135 14.1627 2.90169 13.6144 3.30705C13.5469 3.35698 13.4481 3.43248 13.3949 3.47482C13.3418 3.51715 13.263 3.57453 13.2198 3.60228C13.1766 3.63006 13.0564 3.70968 12.9527 3.77922C12.3933 4.1545 11.3277 4.69494 10.5759 4.9847C10.3573 5.06895 10.1686 5.13788 10.1565 5.13788C10.1445 5.13788 10.0901 5.15677 10.0356 5.17986C9.61615 5.35768 8.20029 5.73335 7.45466 5.86468C7.26458 5.89815 7.05252 5.93906 6.9834 5.95556C6.62389 6.04147 5.14749 6.20576 4.28829 6.25548C3.28019 6.31383 0.717253 6.28714 0.145519 6.21233L0.0309392 6.19735L0.00888413 6.62843C-0.0302306 7.39175 0.0619481 8.52499 0.243321 9.51071C0.322839 9.94297 0.556427 10.8913 0.592934 10.9302C0.639432 10.9798 2.17417 10.7592 3.22901 10.5512C10.0664 9.20355 14.7578 6.05106 15.8124 2.09549C15.9071 1.74012 15.9523 1.49449 16.0462 0.825583C16.0716 0.644647 16.0742 0.675514 16.0637 1.03741C16.0277 2.27715 15.5306 3.70723 14.7118 4.92641C14.5253 5.20416 14.1677 5.68995 14.0327 5.84904C13.5727 6.39084 12.7596 7.20044 12.2458 7.62815C10.5203 9.06462 8.32401 10.3075 5.71099 11.3263C5.44017 11.4318 4.67905 11.7047 4.6553 11.7047C4.645 11.7047 4.59203 11.7235 4.53758 11.7465C4.13632 11.916 1.97345 12.5425 1.42751 12.6473C1.32656 12.6667 1.23737 12.6991 1.22929 12.7194C1.20055 12.7915 1.69883 13.9018 2.15146 14.7743C2.49953 15.4451 2.73881 15.8671 3.10495 16.4558C3.27576 16.7304 3.7736 17.5006 3.7967 17.5259C3.85309 17.5878 5.95168 16.531 7.15619 15.8341C11.1266 13.5369 14.2086 10.6024 15.719 7.68087C16.4574 6.25248 16.784 5.07494 16.823 3.70045C16.8503 2.73652 16.7431 2.04586 16.426 1.14333C16.2181 0.551683 16.2219 0.565664 16.3114 0.719666C16.3549 0.794564 16.4609 1.02607 16.5469 1.23412C17.8051 4.27775 16.8063 8.20691 13.7889 12.083C11.8635 14.5564 9.30989 16.81 6.13513 18.8376C5.68586 19.1245 5.29292 19.3767 5.26194 19.3979C5.21045 19.4333 5.24042 19.4781 5.61143 19.9208C6.18386 20.6037 6.79854 21.2896 7.37087 21.8841C7.8667 22.3991 8.92877 23.4139 9.37065 23.7948L9.60961 24.0009L9.74172 23.8808C11.4549 22.3236 12.3969 21.3556 13.5807 19.9359C16.6262 16.2835 18.5433 12.3873 19.0604 8.79956C19.2372 7.57265 19.2266 6.3492 19.0295 5.23179C18.7614 3.71213 18.1003 2.32874 17.1518 1.30245C16.9638 1.099 16.0713 0.224644 16.0637 0.236446C16.0637 0.236446 16.0206 0.272398 15.9688 0.315188Z" fill="#1C71FF"/>
</svg>
