<svg width="17" height="16" viewBox="0 0 17 16" fill="none" xmlns="http://www.w3.org/2000/svg">
<g id="Frame 1171274183">
<path id="arrow_back_ios" d="M14.2625 5.96574L8.94327 11.3008C8.87995 11.3642 8.81135 11.409 8.73747 11.4354C8.66359 11.4618 8.58443 11.475 8.5 11.475C8.41557 11.475 8.33641 11.4618 8.26253 11.4354C8.18865 11.409 8.12005 11.3642 8.05673 11.3008L2.72164 5.96574C2.57388 5.81798 2.5 5.63329 2.5 5.41165C2.5 5.19002 2.57916 5.00004 2.73747 4.84173C2.89578 4.68342 3.08047 4.60426 3.29156 4.60426C3.50264 4.60426 3.68734 4.68342 3.84565 4.84173L8.5 9.49608L13.1544 4.84173C13.3021 4.69397 13.4842 4.62009 13.7005 4.62009C13.9169 4.62009 14.1042 4.69925 14.2625 4.85756C14.4208 5.01587 14.5 5.20057 14.5 5.41165C14.5 5.62273 14.4208 5.80743 14.2625 5.96574Z" fill="#052B17"/>
</g>
</svg>
