<svg width="18" height="19" viewBox="0 0 18 19" fill="none" xmlns="http://www.w3.org/2000/svg">
<g id="Frame" clip-path="url(#clip0_7014_28562)">
<path id="Vector" d="M3.75 9.62402H14.25" stroke="#888888" stroke-width="1.5" stroke-linecap="round" stroke-linejoin="round"/>
<path id="Vector_2" d="M3.75 9.62402L8.25 14.124" stroke="#888888" stroke-width="1.5" stroke-linecap="round" stroke-linejoin="round"/>
<path id="Vector_3" d="M3.75 9.62402L8.25 5.12402" stroke="#888888" stroke-width="1.5" stroke-linecap="round" stroke-linejoin="round"/>
</g>
<defs>
<clipPath id="clip0_7014_28562">
<rect width="18" height="18" fill="white" transform="translate(0 0.624023)"/>
</clipPath>
</defs>
</svg>
