<svg width="14" height="15" viewBox="0 0 14 15" fill="none" xmlns="http://www.w3.org/2000/svg">
<path d="M7.875 3.125L12.25 7.5L7.875 3.125ZM12.25 7.5L7.875 11.875L12.25 7.5ZM12.25 7.5H1.75H12.25Z" fill="#1C71FF"/>
<path d="M7.875 3.125L12.25 7.5M12.25 7.5L7.875 11.875M12.25 7.5H1.75" stroke="#1C71FF" stroke-width="1.5" stroke-linecap="round" stroke-linejoin="round"/>
</svg>
