<svg width="29" height="28" viewBox="0 0 29 28" fill="none" xmlns="http://www.w3.org/2000/svg">
<g id="Frame">
<g id="Group">
<path id="Icon" d="M20.076 4.2208C20.076 3.46554 20.7023 2.85765 21.4391 2.85765H25.197C25.9523 2.85765 26.5602 3.46554 26.5602 4.2208V14.9419C26.5602 15.6971 25.9523 16.305 25.197 16.305H21.4391C20.6839 16.305 20.076 15.6971 20.076 14.9419V4.2208ZM4.08649 12.6208C3.27596 11.9761 3.14701 10.7971 3.79175 9.98659C4.04965 9.65502 4.41807 9.43396 4.82333 9.34186C4.0128 8.69712 3.88386 7.51817 4.52859 6.72607C4.78649 6.39449 5.15491 6.17344 5.57859 6.06291C4.76807 5.41817 4.63912 4.23923 5.30228 3.4287C5.65228 2.98659 6.18649 2.7287 6.75754 2.7287L17.3496 2.83922C18.1049 2.83922 18.7128 3.44712 18.7128 4.20238V14.9234C18.7128 16.6182 13.297 19.7313 13.0207 21.4076C12.8365 22.4761 13.076 25.2576 12.3391 25.2576C11.0681 25.2576 9.46544 24.7787 9.46544 21.9787C9.46544 19.5103 11.0865 16.305 11.0865 16.305H4.49175C3.46017 16.305 2.63123 15.4761 2.63123 14.4445C2.63123 13.5603 3.23912 12.805 4.08649 12.6208Z" fill="url(#paint0_linear_393_3203)"/>
</g>
</g>
<defs>
<linearGradient id="paint0_linear_393_3203" x1="6.51438" y1="2.19209" x2="23.1998" y2="18.8775" gradientUnits="userSpaceOnUse">
<stop stop-color="#EF5350"/>
<stop offset="1" stop-color="#C62828"/>
</linearGradient>
</defs>
</svg>
