[
  {
    "error_code": "err_pret_deja_ok",
    "error_reason_match" : "Ce document est déjà en prêt sur votre compte.",
    "status" : 403
  },
  {
    "error_code": "err_code_invalide",
    "error_reason_match" : "(reconn(u|aît))",
    "status" : 404
  },
  {
    "error_code": "err_pret_autre",
    "error_reason_match" : "(Cet exemplaire a déjà été emprunté par un autre adhérent|MESSAGE 3)",
    "status" : 409
  },
  {
    "error_code": "err_carte_non_reconnue",
    "error_reason_match" : "(MESSAGE 15)",
    "status" : 401
  }, 
  {
    "error_code": "err_pret_exclu",
    "error_reason_match" : "(MESSAGE 5)",
    "status" : 403
  },
  {
    "error_code": "err_pret_limite",
    "error_reason_match" : "(MESSAGE 2)",
    "status" : 403
  }
]