[
  {
    "error_code": "err_pret_deja_ok",
    "error_reason_match" : "Ce document est déjà en prêt sur votre compte.",
    "status" : 403
  },
  {
    "error_code": "err_code_invalide",
    "error_reason_match" : "Le système ne reconnaît pas ce code barre",
    "status" : 404
  },
  {
    "error_code": "err_pret_autre",
    "error_reason_match" : "Cet exemplaire a déjà été emprunté par un autre adhérent",
    "status" : 409
  },
  {
    "error_code": "err_carte_non_reconnue",
    "error_reason_match" : "L'identifiant usager (?:\\d*) n'a pas été trouvé dans la base",
    "status" : 401
  }, 
  {
    "error_code": "err_pret_exclu",
    "error_reason_match" : "Désolé, ce document ne peut pas être emprunté depuis ce poste",
    "status" : 403
  },
  {
    "error_code": "err_pret_limite",
    "error_reason_match" : "Vous avez emprunté trop d'exemplaires et vous ne pouvez pas en emprunter plus",
    "status" : 403
  }
]