
{
  "resources": {
    "titre": "Conditions Générales d'Utilisation"
  },
  "metadata": {
    "tag": ["legal","Lol"],
    "categories": ["lol"]
  },
  "content":"<body id=\"post-20\" class=\"post-20 page type-page status-publish hentry\"> <header class=\"entry-header\"><h1 class=\"entry-title\">Bienvenue !</h1></header><!-- .entry-header --> <div class=\"entry-content\"> <p><strong>FACE B PARTAGE SES VIBRATIONS ET SES SERVICES :</strong></p> <p>– Créations et documentaires sonores</p> <p>– Communication / Couverture d’événements en images et en sons !</p> <p>– Formations à la réalisation radiophonique et aux pratiques journalistiques (émissions, prise de son, diffusion, reportage et documentaire sonore, couverture de festivals)</p> <p><a href=\"https://web.archive.org/web/20170517073110/http://facebrealisation.org/wp-content/uploads/2014/02/Bande-cassette-5.jpg\"><img class=\"aligncenter size-full wp-image-101\" src=\"https://web.archive.org/web/20170517073110im_/http://facebrealisation.org/wp-content/uploads/2014/02/Bande-cassette-5.jpg\" alt=\"Bande cassette 5\" width=\"560\" height=\"560\"></a></p> </div><!-- .entry-content --> </body>"
}
