[
  {
    "id": 1,
    "area_id": 1,
    "room_name": "A011",
    "description": "IP 193.54.76.157",
    "capacity": 10,
    "max_booking": -1,
    "statut_room": "1",
    "show_fic_room": "y",
    "picture_room": "img_grr1.jpg",
    "comment_room": "<p>Salle de collaboration,\n   jusqu&#39;&agrave; 10 places</p>\r\n\r\n<p>Mur &eacute;critoire,\n    visioconf&eacute;rence avec 2 TV,\n     clickshare (partage sans fil&nbsp;de 1 &agrave; 4 &eacute;crans d&#39;ordinateurs simultan&eacute;e)</p>\r\n\r\n<p>6 chaises &agrave; roulettes.</p>\r\n",
    "show_comment": "n",
    "delais_max_resa_room": -1,
    "delais_min_resa_room": 0,
    "allow_action_in_past": "n",
    "dont_allow_modify": "n",
    "order_display": 0,
    "delais_option_reservation": 0,
    "type_affichage_reser": 0,
    "moderate": 0,
    "qui_peut_reserver_pour": "5",
    "active_ressource_empruntee": "n",
    "active_cle": "n",
    "who_can_see": 0
  },
  {
    "id": 2,
    "area_id": 1,
    "room_name": "A009",
    "description": "IP 193.54.76.150",
    "capacity": 4,
    "max_booking": -1,
    "statut_room": "1",
    "show_fic_room": "y",
    "picture_room": "img_grr2.png",
    "comment_room": "<p>Salle de collaboration - 4 chaises roulantes avec tablette</p>\r\n\r\n<p>Mur &eacute;critoire,\n        visioconf&eacute;rence avec 1 tr&egrave;s grand &eacute;cran TV,\n         clickshare (partage sans fil&nbsp;de 1 &agrave; 2 &eacute;crans d&#39;ordinateurs simultan&eacute;e)</p>\r\n\r\n<p>&nbsp;</p>\r\n",
    "show_comment": "n",
    "delais_max_resa_room": -1,
    "delais_min_resa_room": 0,
    "allow_action_in_past": "n",
    "dont_allow_modify": "n",
    "order_display": 0,
    "delais_option_reservation": 0,
    "type_affichage_reser": 0,
    "moderate": 0,
    "qui_peut_reserver_pour": "5",
    "active_ressource_empruntee": "n",
    "active_cle": "n",
    "who_can_see": 0
  },
  {
    "id": 3,
    "area_id": 1,
    "room_name": "A010",
    "description": "Pas de visio",
    "capacity": 6,
    "max_booking": -1,
    "statut_room": "1",
    "show_fic_room": "y",
    "picture_room": "img_grr3.jpg",
    "comment_room": "<p>Petite salle de collaboration</p>\r\n\r\n<p>Chauffeuse + mur &eacute;critoire</p>\r\n",
    "show_comment": "n",
    "delais_max_resa_room": -1,
    "delais_min_resa_room": 0,
    "allow_action_in_past": "n",
    "dont_allow_modify": "n",
    "order_display": 0,
    "delais_option_reservation": 0,
    "type_affichage_reser": 0,
    "moderate": 0,
    "qui_peut_reserver_pour": "5",
    "active_ressource_empruntee": "n",
    "active_cle": "n",
    "who_can_see": 0
  },
  {
    "id": 25,
    "area_id": 1,
    "room_name": "Cabane verte",
    "description": "IP 193.54.76.229",
    "capacity": 2,
    "max_booking": -1,
    "statut_room": "1",
    "show_fic_room": "y",
    "picture_room": "",
    "comment_room": "<p>Dans le forum,\n              la cabane verte contient un poste de visioconf&eacute;rence pour 1 &agrave; 2 personnes.</p>\r\n",
    "show_comment": "n",
    "delais_max_resa_room": 2,
    "delais_min_resa_room": 0,
    "allow_action_in_past": "n",
    "dont_allow_modify": "n",
    "order_display": 0,
    "delais_option_reservation": 0,
    "type_affichage_reser": 0,
    "moderate": 0,
    "qui_peut_reserver_pour": "5",
    "active_ressource_empruntee": "n",
    "active_cle": "n",
    "who_can_see": 0
  },
  {
    "id": 42,
    "area_id": 1,
    "room_name": "A008",
    "description": "Salle de réunion SANS visio",
    "capacity": 8,
    "max_booking": -1,
    "statut_room": "1",
    "show_fic_room": "n",
    "picture_room": "",
    "comment_room": "",
    "show_comment": "n",
    "delais_max_resa_room": -1,
    "delais_min_resa_room": 0,
    "allow_action_in_past": "n",
    "dont_allow_modify": "n",
    "order_display": 0,
    "delais_option_reservation": 0,
    "type_affichage_reser": 0,
    "moderate": 0,
    "qui_peut_reserver_pour": "5",
    "active_ressource_empruntee": "n",
    "active_cle": "n",
    "who_can_see": 3
  }
]
