{
  "$schema": "https://learnfram.gitlab.io/learnfram-docs/schema/microservices/schema.json",
  "id": 1,
  "name": "ipstcnam.organizers.data_organized_random_crop",
  "description": "Data organized Random Crop",
  "collection": "organizers",
  "contributor": "ipstcnam",
  "version": "1.0.0",
  "port": 8000,
  "parameters": [
    {
      "name": "R_test",
      "type": "float",
      "minimum": 0,
      "maximum": 1
    }
  ],
  "inputs": [
    {
      "name": "fv",
      "description": "List of FeatureVector",
      "type": [
        "array"
      ],
      "items_type": "feature_vector"
    },
    {
      "name": "lv",
      "description": "List of LabelsVector",
      "type": [
        "array"
      ],
      "items_type": "label_vector"
    }
  ],
  "outputs": [
    {
      "name": "fv_train",
      "description": "List of FeatureVectorTrain",
      "type": [
        "array"
      ],
      "items_type": "feature_vector_train"
    },
    {
      "name": "fv_test",
      "description": "List of FeatureVectorTest",
      "type": [
        "array"
      ],
      "items_type": "feature_vector_test"
    },
    {
      "name": "lv_train",
      "description": "List of LabelsVectorTrain",
      "type": [
        "array"
      ],
      "items_type": "label_vector_train"
    },
    {
      "name": "lv_test",
      "description": "List of LabelsVectorTest",
      "type": [
        "array"
      ],
      "items_type": "label_vector_test"
    }
  ],
  "docker_image": "ipstcnam/data_organized_random_crop"
}

{
  "campaign": {
    "id": 1,
    "name": "campaign_1"
  },
  "subject": {
    "id": 1,
    "name": "subject_1"
  },
  "modality": "1D",
  "sensor": {
    "id": 1,
    "name": "ECG"
  },
  "source_file": {
    "id": 1,
    "name": "rawData.csv"
  },
  "file_name": "dimension_reductor_afd2c5de-fab0-11ea-85ed-0242ac120007.csv",
  "file_data": {
    "ECG1": [
      0,
      1,
      0,
      1,
      0,
      0,
      0,
      1
    ]
  }
}



{
  "campaign_name": "campaign_1",
  "subject_name": "subject_1",
  "modality": "1D",
  "source_name": "ECG",
  "files": [
    {
      "id": 53,
      "name": "dimension_reductor_79c8882a-fab5-11ea-8d6d-0242ac120007.csv"
    }
  ],
  "segment_size": 512,
  "sources_count": 2,
  "segment_overlap": 0
}


{
  "campaign_name": "campaign_1",
  "subject_name": "subject_1",
  "modality": "1D",
  "source_name": "ECG",
  "files": [
    {
      "id": 1,
      "name": "rawData.csv"
    }
  ],
  "segment_size": 512,
  "sources_count": 2,
  "segment_overlap": 0
}



{
  "campaign_name": "campaign_1",
  "subject_name": "subject_1", 
  "modality": "1D", 
  "source_name": "ECG", 
  "files": [
    {
      "id": 53, 
      "name": "dimension_reductor_79c8882a-fab5-11ea-8d6d-0242ac120007.csv"
    }
  ], 
  "segment_size": 512, 
  "sources_count": 2, 
  "segment_overlap": 0
}