module todoapp

go 1.16

require (
	github.com/gorilla/handlers v1.5.1 // indirect
	github.com/gorilla/mux v1.8.0 // indirect
	github.com/stretchr/testify v1.7.0 // indirect
	go.mongodb.org/mongo-driver v1.5.2 // indirect
)
