<svg viewBox="0 0 24 24" fill="currentColor" xmlns="http://www.w3.org/2000/svg">
  <path d="M18.1449 5.21892C17.2349 6.09833 16.5113 7.15191 16.017 8.31687C15.6535 9.17377 15.4195 10.078 15.3212 11H19V13H15.3213C15.4196 13.9218 15.6535 14.826 16.017 15.6828C16.5113 16.8478 17.2349 17.9013 18.1449 18.7808L16.755 20.2189C15.6521 19.153 14.7749 17.876 14.1759 16.4639C13.7074 15.3598 13.4165 14.1907 13.3119 13H10.6865C10.5824 14.1907 10.2919 15.3598 9.82376 16.4639C9.22497 17.8762 8.34781 19.1533 7.24462 20.2191L5.85498 18.7808C6.76497 17.9016 7.48851 16.8481 7.98244 15.6832C8.34578 14.8263 8.57938 13.922 8.67721 13H5V11H8.67722C8.5794 10.078 8.34579 9.17364 7.98244 8.31667C7.48851 7.15176 6.76497 6.09829 5.85498 5.21913L7.24462 3.78076C8.34781 4.84657 9.22497 6.12371 9.82376 7.53595C10.292 8.64017 10.5825 9.80929 10.6865 11H13.3119C13.4164 9.80918 13.7074 8.64001 14.1759 7.53575C14.7749 6.12371 15.6521 4.84669 16.755 3.78076L18.1449 5.21892Z" />
</svg>
