<svg viewBox="0 0 24 24" fill="currentColor" xmlns="http://www.w3.org/2000/svg">
  <path fill-rule="evenodd" clip-rule="evenodd" d="M3.5 4C4.43455 4 5.32683 4.37865 5.98166 5.04622L6 5.06507L6.01834 5.04622C6.67317 4.37865 7.56545 4 8.5 4C9.43455 4 10.3268 4.37865 10.9817 5.04622L10.9954 5.06036L11.0227 5.0326C11.6785 4.37224 12.5695 4 13.5 4C14.4305 4 15.3215 4.37224 15.9773 5.0326C16.6329 5.69272 17 6.58659 17 7.51721V8C19.2091 8 21 9.79086 21 12V12.8902C21 13.8451 20.6584 14.7684 20.037 15.4934L17.9718 17.9028C18.1393 17.9666 18.3181 18 18.5 18C18.8956 18 19.2764 17.8418 19.5582 17.558L20.9773 18.9674C20.3215 19.6278 19.4305 20 18.5 20C17.5695 20 16.6785 19.6278 16.0227 18.9674C15.3671 18.3073 15 17.4134 15 16.4828V7.51721C15 7.11262 14.8403 6.72596 14.5582 6.44195C14.2764 6.15817 13.8956 6 13.5 6C13.1044 6 12.7236 6.15817 12.4418 6.44195C12.1597 6.72596 12 7.11262 12 7.51721V16H10V7.54866C10 7.13177 9.83737 6.73576 9.55388 6.44674C9.27102 6.15838 8.89154 6 8.5 6C8.10846 6 7.72898 6.15838 7.44612 6.44674C7.16263 6.73576 7 7.13177 7 7.54866V16H5V7.54866C5 7.13177 4.83737 6.73576 4.55388 6.44674C4.27102 6.15838 3.89154 6 3.5 6V4ZM17 15.9634L18.5185 14.1918C18.8292 13.8293 19 13.3677 19 12.8902V12C19 10.8954 18.1046 10 17 10V15.9634Z" />
</svg>
