<svg viewBox="0 0 24 24" fill="currentColor" xmlns="http://www.w3.org/2000/svg">
  <path d="M18.25 5.11997C17.5804 4.80997 16.8342 4.70439 16.1049 4.81645C15.3756 4.92852 14.6956 5.25324 14.15 5.74997C13.1722 6.59157 12.4745 7.71141 12.15 8.95997C12.09 9.18997 12.04 9.42997 11.98 9.66997C11.92 9.42997 11.87 9.18997 11.81 8.95997C11.4854 7.71141 10.7877 6.59157 9.80997 5.74997C9.26435 5.25324 8.58431 4.92852 7.85501 4.81645C7.1257 4.70439 6.37955 4.80997 5.70997 5.11997C5.06612 5.52486 4.55106 6.10491 4.22517 6.79213C3.89927 7.47934 3.77606 8.24522 3.86997 8.99997C3.93798 10.1517 4.32966 11.2609 4.99997 12.2L6.61997 11C6.18308 10.3807 5.9206 9.65541 5.85997 8.89997C5.80788 8.52389 5.85632 8.14072 6.00035 7.78943C6.14438 7.43814 6.37887 7.13125 6.67997 6.89997C6.99781 6.78317 7.34183 6.75685 7.67374 6.82394C8.00565 6.89103 8.31244 7.04889 8.55997 7.27997C9.21973 7.86428 9.68692 8.6348 9.89997 9.48997C10.6815 12.9374 11.0507 16.4654 11 20H13C12.9492 16.4654 13.3185 12.9374 14.1 9.48997C14.3112 8.6312 14.7785 7.85695 15.44 7.26997C15.6875 7.03889 15.9943 6.88103 16.3262 6.81394C16.6581 6.74685 17.0021 6.77317 17.32 6.88997C17.6211 7.12125 17.8556 7.42814 17.9996 7.77943C18.1436 8.13072 18.192 8.51389 18.14 8.88997C18.0811 9.64887 17.8185 10.3778 17.38 11L19 12.2C19.6703 11.2609 20.062 10.1517 20.13 8.99997C20.2199 8.24122 20.0906 7.47259 19.7575 6.785C19.4243 6.0974 18.9012 5.51961 18.25 5.11997Z" />
</svg>
