[{
  "uri" : "General",
  "title" : "General"
}, {
  "uri" : "Sales",
  "title" : "Sales"
}, {
  "uri" : "Customer Service",
  "title" : "Customer Service"
}, {
  "uri" : "Operations",
  "title" : "Operations",
  "icon" : "wrench"
}, {
  "uri" : "Field Service",
  "title" : "Field Service",
  "icon" : "wrench"
}, {
  "uri" : "Project Services Automation",
  "title" : "Project Services Automation",
  "icon" : "wrench"
}, {
  "uri" : "Marketing",
  "title" : "Marketing",
  "icon" : "bar-chart"
}, {
  "uri" : "Financials",
  "title" : "Financials",
  "icon" : "money"
}, {
  "uri" : "Customer Insights",
  "title" : "Customer Insights",
  "icon" : "lightbulb-o"
}]
