[
  {
    "toys": [
      {
        "_attr": {
          "decade": "80s",
          "locale": "US"
        }
      },
      {
        "toy": "Transformers"
      },
      {
        "toy": [
          {
            "_attr": {
              "knowing": "half the battle"
            }
          },
          "GI Joe"
        ]
      },
      {
        "toy": [
          {
            "name": "He-man"
          },
          {
            "description": {
              "_cdata": "<strong>Master of the Universe!</strong>"
            }
          }
        ]
      }
    ]
  }
]
