{
  "environment": "web",
  "format": "html",
  "prefix": "https://storage.googleapis.com",
  "mainga": "UA-49880327-14",
  "updated": "2020-06-30T18:29:47+02:00",
  "id": "tp4",
  "duration": 1,
  "title": "TP4 - Orchestration",
  "authors": "OCTO Technology",
  "summary": "TP4",
  "source": "tp4.md",
  "theme": "",
  "status": [
    "published"
  ],
  "category": [
    "tp",
    "api"
  ],
  "tags": [
    "api",
    "flask"
  ],
  "feedback": "https://gitlab.com/octo-technology/octo-bda/cercle-formation/dsin2/-/issues/new",
  "url": "tp4"
}
