{
  "environment": "web",
  "format": "html",
  "prefix": "https://storage.googleapis.com",
  "mainga": "UA-49880327-14",
  "updated": "2020-06-24T13:55:54+02:00",
  "id": "tp6",
  "duration": 1,
  "title": "TP6 - Model registry",
  "authors": "OCTO Technology",
  "summary": "TP6",
  "source": "tp6.md",
  "theme": "",
  "status": [
    "published"
  ],
  "category": [
    "tp",
    "api"
  ],
  "tags": [
    "api",
    "flask"
  ],
  "feedback": "https://gitlab.com/octo-technology/octo-bda/cercle-formation/dsin2/-/issues/new",
  "url": "tp6"
}
