-------------------------------------------------------------------------------
Test set: fr.ldnr.app.mavenproject1.PresentationChargeurTest
-------------------------------------------------------------------------------
Tests run: 1, Failures: 0, Errors: 0, Skipped: 0, Time elapsed: 0.224 sec
