/home/stag/NetBeansProjects/mavenproject2hib/src/main/java/fr/ldnr/kevin/mavenproject2hib/Attraction.java
/home/stag/NetBeansProjects/mavenproject2hib/src/main/java/fr/ldnr/kevin/mavenproject2hib/Destination.java
/home/stag/NetBeansProjects/mavenproject2hib/src/main/java/fr/ldnr/kevin/mavenproject2hib/OffreMain.java
/home/stag/NetBeansProjects/mavenproject2hib/src/main/java/fr/ldnr/kevin/mavenproject2hib/Voyage.java
