[gd_scene load_steps=3 format=2]

[ext_resource path="res://movableObject.tscn" type="PackedScene" id=1]
[ext_resource path="res://graphics_cave/stone_triangle.png" type="Texture" id=2]

[node name="Triangle" type="RigidBody2D"]
input_pickable = true
mode = 1

[node name="CollisionPolygon2D" type="CollisionPolygon2D" parent="."]
position = Vector2( -21.5362, -5.9274 )
polygon = PoolVector2Array( 45.3987, -23.6073, -36.7944, 25.3925, 45.5962, 26.1828 )

[node name="Sprite" type="Sprite" parent="."]
position = Vector2( -18.915, -2.61478 )
rotation = -0.0407037
scale = Vector2( 0.607119, 0.562577 )
texture = ExtResource( 2 )

[node name="MovableObject" parent="." instance=ExtResource( 1 )]
