[gd_scene load_steps=14 format=2]

[ext_resource path="res://graphics_shadow_palace/bg.png" type="Texture" id=1]
[ext_resource path="res://graphics_shadow_palace/arc_full.png" type="Texture" id=2]
[ext_resource path="res://graphics_shadow_palace/ground.png" type="Texture" id=3]
[ext_resource path="res://player.tscn" type="PackedScene" id=4]
[ext_resource path="res://ui/overlay.tscn" type="PackedScene" id=5]
[ext_resource path="res://cameras/construction_camera.tscn" type="PackedScene" id=6]
[ext_resource path="res://levels/shadow_palace/figure.tscn" type="PackedScene" id=8]
[ext_resource path="res://levels/shadow_palace/shadow_palace_column1.tscn" type="PackedScene" id=9]
[ext_resource path="res://levels/shadow_palace/shadow_palace_column3.tscn" type="PackedScene" id=10]
[ext_resource path="res://levels/shadow_palace/shadow_palace_column2.tscn" type="PackedScene" id=11]
[ext_resource path="res://levels/shadow_palace/shadow_palace_column_broken.tscn" type="PackedScene" id=12]
[ext_resource path="res://exit.tscn" type="PackedScene" id=13]
[ext_resource path="res://graphics_shadow_palace/bg2.png" type="Texture" id=14]

[node name="ShadowPalace" type="Node2D"]

[node name="Bg" type="Sprite" parent="."]
position = Vector2( 648, 360 )
scale = Vector2( 2, 2 )
texture = ExtResource( 1 )

[node name="Sprite" type="Sprite" parent="."]
position = Vector2( 608, 384 )
scale = Vector2( 1.08125, 1.11111 )
texture = ExtResource( 14 )

[node name="Ground" type="StaticBody2D" parent="."]

[node name="CollisionPolygon2D" type="CollisionPolygon2D" parent="Ground"]
position = Vector2( 0, 2.52271 )
polygon = PoolVector2Array( -1.83862, 527.637, 112.523, 530.16, 123.455, 537.728, 131.864, 551.182, 141.955, 562.114, 148.682, 583.136, 156.25, 602.477, 166.341, 615.931, 188.204, 618.454, 211.749, 624.34, 239.499, 624.34, 254.635, 620.976, 268.93, 611.727, 283.225, 610.045, 289.112, 613.408, 301.725, 643.681, 306.77, 656.294, 314.338, 690.771, 320.225, 703.384, 329.475, 663.862, 327.793, 652.09, 344.611, 638.635, 353.02, 608.363, 374.042, 597.431, 384.133, 568.841, 385.815, 559.591, 397.587, 544.455, 390.86, 531.001, 389.178, 516.705, 384.133, 507.455, 405.996, 494.842, 408, 477.477, 440, 477.477, 464, 437.477, 488, 413.477, 520, 381.477, 552, 365.477, 568, 365.477, 584, 381.477, 585.948, 397.298, 588.471, 424.207, 587.63, 444.388, 584.266, 473.82, 587.63, 486.433, 627.152, 504.092, 650.697, 509.978, 659.947, 516.705, 665.833, 540.25, 668.356, 557.909, 673.401, 575.568, 680.128, 587.341, 688.537, 606.681, 695.265, 622.658, 714.605, 607.522, 720.491, 559.591, 728.9, 534.364, 728.059, 506.615, 729.741, 478.024, 728.9, 441.025, 735.628, 418.32, 745.718, 409.911, 757.491, 415.798, 759.172, 446.911, 758.332, 494.842, 760.854, 531.841, 762.536, 554.546, 765.059, 575.568, 770.945, 592.386, 780.195, 596.59, 801.217, 555.387, 813.831, 539.409, 831.49, 514.183, 834.012, 486.433, 823.081, 453.638, 807.104, 425.888, 777.672, 401.502, 775.99, 386.366, 795.331, 356.094, 801.217, 338.435, 819.58, 337.824, 821.582, 327.812, 845.61, 326.477, 858.398, 340.958, 863.443, 369.549, 859.239, 390.571, 864.284, 426.729, 868.489, 454.479, 870.171, 519.228, 883.625, 565.477, 899.602, 599.113, 939.124, 543.614, 960.147, 478.865, 978.646, 451.956, 1010.6, 427.57, 1019.01, 375.435, 1057.69, 333.39, 1099.74, 330.026, 1293.14, 330.867, 1297.35, 738.702, -27.9066, 727.77 )

[node name="Sprite" type="Sprite" parent="Ground"]
position = Vector2( 640, 360 )
scale = Vector2( 0.5, 0.5 )
texture = ExtResource( 3 )

[node name="Player" parent="." instance=ExtResource( 4 )]
position = Vector2( 13.3629, 455.918 )

[node name="Overlay" parent="." instance=ExtResource( 5 )]

[node name="ConstructionCamera" parent="." instance=ExtResource( 6 )]

[node name="Figure" parent="." instance=ExtResource( 8 )]
position = Vector2( 89.3336, 479.418 )

[node name="Figure2" parent="." instance=ExtResource( 8 )]
position = Vector2( 1105.93, 281.693 )

[node name="Figure3" parent="." instance=ExtResource( 8 )]
position = Vector2( 1156.94, 279.7 )

[node name="Figure4" parent="." instance=ExtResource( 8 )]
position = Vector2( 832.839, 279.192 )

[node name="Column6" parent="." instance=ExtResource( 9 )]
position = Vector2( 425.814, 453.762 )

[node name="Column5" parent="." instance=ExtResource( 9 )]
position = Vector2( 165.05, 204.803 )

[node name="Column7" parent="." instance=ExtResource( 9 )]
position = Vector2( 1203.22, 147.725 )

[node name="Column4" parent="." instance=ExtResource( 9 )]
position = Vector2( 425.814, 352 )

[node name="Column3" parent="." instance=ExtResource( 9 )]
position = Vector2( 686.025, 208 )

[node name="Column2" parent="." instance=ExtResource( 9 )]
position = Vector2( 425.814, 250.724 )

[node name="Column" parent="." instance=ExtResource( 9 )]
position = Vector2( 425.814, 198 )

[node name="Column-2" parent="." instance=ExtResource( 11 )]
position = Vector2( 425.814, 400 )

[node name="Column-3" parent="." instance=ExtResource( 11 )]
position = Vector2( 1203.22, 304 )

[node name="Column-4" parent="." instance=ExtResource( 11 )]
position = Vector2( 686.025, 157.725 )

[node name="Column-10" parent="." instance=ExtResource( 11 )]
position = Vector2( 1203.22, 200 )

[node name="Column-5" parent="." instance=ExtResource( 11 )]
position = Vector2( 165.05, 154.97 )

[node name="Column-6" parent="." instance=ExtResource( 10 )]
position = Vector2( 425.814, 301.121 )

[node name="Column-7" parent="." instance=ExtResource( 10 )]
position = Vector2( 425.814, 144 )

[node name="Column-9" parent="." instance=ExtResource( 10 )]
position = Vector2( 686.025, 256 )

[node name="Column-8" parent="." instance=ExtResource( 10 )]
position = Vector2( 1203.22, 250.724 )

[node name="Column-11" parent="." instance=ExtResource( 12 )]
position = Vector2( 165.05, 256 )

[node name="Column-12" parent="." instance=ExtResource( 12 )]
position = Vector2( 686.025, 304 )

[node name="Arc" type="Sprite" parent="."]
position = Vector2( 640, 88 )
scale = Vector2( 0.5, 0.5 )
texture = ExtResource( 2 )

[node name="Exit" parent="." instance=ExtResource( 13 )]
position = Vector2( 1256, 216 )
