[gd_scene load_steps=3 format=2]

[ext_resource path="res://movableObject.tscn" type="PackedScene" id=1]
[ext_resource path="res://graphics/temple_roof_2.png" type="Texture" id=2]

[node name="Roof2" type="RigidBody2D"]
input_pickable = true
mode = 1

[node name="CollisionPolygon2D" type="CollisionPolygon2D" parent="."]
polygon = PoolVector2Array( -30.8934, 15.3042, -33.725, 13.1804, -29.5956, 2.91581, -21.6906, -4.87115, -7.06058, -9.70851, -2.34122, -12.4221, -2.4592, -15.3718, 1.43428, -24.2206, 5.7997, -15.2538, 7.45148, -10.4164, 22.1995, -5.93301, 32.1102, 0.91008, 38.0094, 13.7704, 34.4699, 14.7142, 33.762, 29.2263, -30.7754, 29.3443 )

[node name="Sprite" type="Sprite" parent="."]
position = Vector2( 0.0166082, -0.0823894 )
scale = Vector2( 0.25, 0.25 )
texture = ExtResource( 2 )

[node name="MovableObject" parent="." instance=ExtResource( 1 )]
