[gd_scene load_steps=3 format=2]

[ext_resource path="res://movableObject.tscn" type="PackedScene" id=1]
[ext_resource path="res://graphics/trieme.png" type="Texture" id=2]

[node name="Trieme" type="RigidBody2D"]
input_pickable = true
mode = 1

[node name="CollisionPolygon2D" type="CollisionPolygon2D" parent="."]
rotation = 0.0209029
scale = Vector2( 1.60409, 1.6509 )
polygon = PoolVector2Array( -46.5384, 0.632747, -47.2364, -3.15419, -45.994, -7.15851, -44.6962, -8.51176, -43.4972, -1.90625, -39.4926, 3.57972, -36.0976, 5.27689, -23.6945, 6.52053, -0.107394, 5.67378, -0.54462, -6.78256, 4.57556, -2.91125, 5.204, 6.00479, 29.0655, 5.59435, 36.0796, 2.79548, 36.5836, -2.69633, 33.0578, -6.42415, 27.2307, -10.2807, 26.4387, -14.3309, 28.2243, -17.7277, 29.6123, -18.9944, 35.0693, -15.9258, 33.8048, -12.9819, 33.2397, -10.4063, 35.937, -8.2525, 41.2302, -4.56163, 43.5355, -0.0126226, 41.5717, 7.54309, 28.1864, 18.5202, -39.3331, 19.6666, -33.7514, 16.0136, -36.9625, 10.4226, -41.7089, 7.51599 )

[node name="Sprite" type="Sprite" parent="."]
position = Vector2( 0.0166082, -0.0823894 )
rotation = -0.863621
scale = Vector2( 0.4, 0.4 )
texture = ExtResource( 2 )

[node name="MovableObject" parent="." instance=ExtResource( 1 )]
