[gd_scene load_steps=4 format=2]

[ext_resource path="res://movableObject.tscn" type="PackedScene" id=1]
[ext_resource path="res://graphics/temple_architrav1.png" type="Texture" id=2]

[sub_resource type="RectangleShape2D" id=1]
extents = Vector2( 59.5786, 4.05091 )

[node name="Architrav1" type="RigidBody2D"]
input_pickable = true
mode = 1

[node name="CollisionShape2D" type="CollisionShape2D" parent="."]
shape = SubResource( 1 )

[node name="Sprite" type="Sprite" parent="."]
position = Vector2( 0.0166159, 0.0579209 )
scale = Vector2( 0.25, 0.25 )
texture = ExtResource( 2 )

[node name="MovableObject" parent="." instance=ExtResource( 1 )]
