[gd_scene load_steps=4 format=2]

[ext_resource path="res://movableObject.tscn" type="PackedScene" id=1]
[ext_resource path="res://graphics_shadow_palace/column1.png" type="Texture" id=2]

[sub_resource type="RectangleShape2D" id=1]
extents = Vector2( 12.6865, 24.9869 )

[node name="Figure" type="RigidBody2D"]
input_pickable = true
mode = 1
mass = 25.44

[node name="Sprite" type="Sprite" parent="."]
position = Vector2( -0.455331, -0.0394413 )
scale = Vector2( 0.5, 0.5 )
texture = ExtResource( 2 )

[node name="MovableObject" parent="." instance=ExtResource( 1 )]

[node name="CollisionShape2D" type="CollisionShape2D" parent="."]
shape = SubResource( 1 )
