[gd_scene load_steps=4 format=2]

[ext_resource path="res://movableObject.tscn" type="PackedScene" id=1]
[ext_resource path="res://graphics_cave/stone.png" type="Texture" id=2]

[sub_resource type="CircleShape2D" id=1]
radius = 38.5716

[node name="Barrel" type="RigidBody2D"]
input_pickable = true
mode = 1
mass = 4.0

[node name="Sprite" type="Sprite" parent="."]
position = Vector2( -0.298369, 0.687884 )
scale = Vector2( 0.568752, 0.580026 )
texture = ExtResource( 2 )

[node name="CollisionShape2D" type="CollisionShape2D" parent="."]
shape = SubResource( 1 )

[node name="MovableObject" parent="." instance=ExtResource( 1 )]
position = Vector2( 0.048439, -0.435926 )
