[gd_scene load_steps=4 format=2]

[ext_resource path="res://graphics/test.png" type="Texture" id=1]
[ext_resource path="res://Water_spring.gd" type="Script" id=2]

[sub_resource type="RectangleShape2D" id=1]

[node name="Water_spring" type="Node2D"]
position = Vector2( 5.38, -6.886 )
scale = Vector2( 1.02027, 0.848486 )
script = ExtResource( 2 )

[node name="Sprite" type="Sprite" parent="."]
visible = false
texture = ExtResource( 1 )

[node name="Area2D" type="Area2D" parent="."]
visible = false

[node name="CollisionShape2D" type="CollisionShape2D" parent="Area2D"]
shape = SubResource( 1 )
