[gd_scene load_steps=6 format=2]

[ext_resource path="res://sounds/button.wav" type="AudioStream" id=1]
[ext_resource path="res://sounds/sounds.gd" type="Script" id=2]
[ext_resource path="res://sounds/drop.wav" type="AudioStream" id=3]
[ext_resource path="res://sounds/drag.wav" type="AudioStream" id=4]
[ext_resource path="res://sounds/jump.wav" type="AudioStream" id=5]

[node name="Sounds" type="Node"]
script = ExtResource( 2 )

[node name="Button" type="AudioStreamPlayer" parent="."]
stream = ExtResource( 1 )

[node name="Drag" type="AudioStreamPlayer" parent="."]
stream = ExtResource( 4 )

[node name="Drop" type="AudioStreamPlayer" parent="."]
stream = ExtResource( 3 )

[node name="Jump" type="AudioStreamPlayer" parent="."]
stream = ExtResource( 5 )
volume_db = 13.126
