{ "height":40,
 "infinite":false,
 "layers":[
        {
         "data":[0, 0, 0, 0, 0, 0, 0, 0, 0, 0, 0, 0, 0, 0, 0, 0, 0, 0, 0, 0, 0, 0, 0, 0, 0, 0, 0, 0, 0, 0, 0, 0, 0, 0, 0, 0, 0, 0, 0, 0, 0, 0, 0, 0, 0, 0, 0, 0, 0, 0, 0, 0, 0, 0, 0, 0, 0, 0, 0, 0, 0, 0, 0, 0, 0, 0, 0, 0, 0, 0, 0, 0, 0, 0, 0, 0, 0, 0, 0, 0, 0, 0, 0, 0, 0, 0, 0, 0, 0, 0, 0, 0, 0, 0, 0, 0, 0, 0, 0, 0, 0, 0, 0, 0, 0, 0, 0, 0, 0, 0, 0, 0, 0, 0, 0, 0, 0, 0, 0, 0, 0, 0, 0, 0, 0, 0, 0, 0, 0, 0, 0, 0, 0, 0, 0, 0, 0, 0, 0, 0, 0, 0, 0, 0, 0, 0, 0, 0, 0, 0, 0, 0, 0, 0, 0, 0, 0, 0, 0, 0, 0, 0, 0, 0, 0, 0, 0, 0, 0, 0, 0, 0, 0, 0, 0, 0, 0, 0, 0, 0, 0, 0, 0, 0, 0, 0, 0, 0, 0, 0, 0, 0, 0, 0, 0, 0, 0, 0, 0, 0, 0, 0, 0, 0, 0, 0, 0, 0, 0, 0, 0, 0, 0, 0, 0, 0, 0, 0, 0, 0, 0, 0, 0, 0, 0, 0, 0, 0, 0, 0, 0, 0, 0, 0, 0, 0, 0, 0, 0, 0, 0, 0, 0, 0, 0, 0, 0, 0, 0, 0, 0, 0, 0, 0, 0, 0, 0, 0, 0, 0, 0, 0, 0, 0, 0, 0, 0, 0, 0, 0, 0, 0, 0, 0, 0, 0, 0, 0, 0, 0, 0, 0, 0, 0, 0, 0, 0, 0, 0, 0, 0, 0, 0, 0, 0, 0, 0, 0, 0, 0, 0, 0, 0, 0, 0, 0, 0, 0, 0, 0, 0, 0, 0, 0, 0, 0, 0, 0, 0, 0, 0, 0, 0, 0, 0, 0, 0, 0, 0, 0, 0, 0, 0, 0, 0, 0, 0, 0, 0, 0, 0, 0, 0, 0, 0, 0, 0, 0, 0, 0, 0, 0, 0, 0, 0, 0, 0, 0, 0, 0, 0, 0, 0, 0, 0, 0, 0, 0, 0, 0, 0, 0, 0, 0, 0, 0, 0, 0, 0, 0, 0, 0, 0, 0, 0, 0, 0, 0, 0, 0, 0, 0, 0, 0, 0, 0, 0, 0, 0, 0, 0, 0, 0, 0, 0, 0, 0, 0, 0, 0, 0, 0, 0, 0, 0, 0, 0, 0, 0, 0, 0, 0, 0, 0, 0, 0, 0, 0, 0, 0, 0, 0, 0, 0, 0, 0, 0, 0, 0, 0, 0, 0, 0, 0, 0, 0, 0, 0, 0, 0, 0, 0, 0, 0, 0, 0, 0, 0, 0, 0, 0, 0, 0, 0, 0, 0, 0, 0, 0, 0, 0, 0, 0, 0, 0, 0, 0, 0, 0, 0, 0, 0, 0, 0, 0, 0, 0, 0, 0, 0, 0, 0, 0, 0, 0, 0, 0, 0, 0, 0, 0, 0, 0, 0, 0, 0, 0, 0, 0, 0, 0, 0, 0, 0, 0, 0, 0, 0, 0, 0, 0, 0, 0, 0, 0, 0, 0, 0, 0, 0, 0, 0, 0, 0, 0, 0, 0, 0, 0, 0, 0, 0, 0, 0, 0, 0, 0, 0, 0, 0, 0, 0, 0, 0, 0, 0, 0, 0, 0, 0, 0, 0, 0, 0, 0, 0, 0, 0, 0, 0, 0, 0, 0, 0, 0, 0, 0, 0, 0, 0, 0, 0, 0, 0, 0, 0, 0, 0, 0, 0, 0, 0, 0, 0, 0, 0, 0, 0, 0, 0, 0, 0, 0, 0, 0, 0, 0, 0, 0, 0, 0, 0, 0, 0, 0, 0, 0, 0, 0, 0, 0, 0, 0, 0, 0, 0, 0, 0, 0, 0, 0, 0, 0, 0, 0, 0, 0, 0, 0, 0, 0, 0, 0, 0, 0, 0, 0, 0, 0, 0, 0, 0, 0, 0, 0, 0, 0, 0, 0, 0, 0, 0, 0, 0, 0, 0, 0, 0, 0, 0, 0, 0, 0, 0, 0, 0, 0, 0, 0, 0, 0, 0, 0, 0, 0, 0, 0, 0, 0, 0, 0, 0, 0, 0, 0, 0, 0, 0, 0, 0, 0, 0, 0, 0, 0, 0, 0, 0, 0, 0, 0, 0, 0, 0, 0, 0, 0, 0, 0, 0, 0, 0, 0, 0, 0, 0, 0, 0, 0, 0, 0, 0, 0, 0, 0, 0, 0, 0, 0, 0, 0, 0, 0, 0, 0, 0, 0, 0, 0, 0, 0, 0, 0, 0, 0, 0, 0, 0, 0, 0, 0, 0, 0, 0, 0, 0, 0, 0, 0, 0, 0, 0, 0, 0, 0, 0, 0, 0, 0, 0, 0, 0, 0, 0, 0, 0, 0, 0, 0, 0, 0, 0, 0, 0, 0, 0, 0, 0, 0, 0, 0, 0, 0, 0, 0, 0, 0, 0, 0, 0, 0, 0, 0, 0, 0, 0, 0, 0, 0, 0, 0, 0, 0, 0, 0, 0, 0, 0, 0, 0, 0, 0, 0, 0, 0, 0, 0, 0, 0, 0, 0, 0, 0, 0, 0, 0, 0, 0, 0, 0, 0, 0, 0, 0, 0, 0, 0, 0, 0, 0, 0, 0, 0, 0, 0, 0, 0, 0, 0, 0, 0, 0, 0, 0, 0, 0, 0, 0, 0, 0, 0, 0, 0, 0, 0, 0, 0, 0, 0, 0, 0, 0, 0, 0, 0, 0, 0, 0, 0, 0, 0, 0, 0, 0, 0, 0, 0, 0, 0, 0, 0, 0, 0, 0, 0, 0, 0, 0, 0, 0, 0, 0, 0, 0, 0, 0, 0, 0, 0, 0, 0, 0, 0, 0, 0, 0, 0, 0, 0, 0, 0, 0, 0, 0, 0, 0, 0, 0, 0, 0, 0, 0, 0, 0, 0, 0, 0, 0, 0, 0, 0, 0, 0, 0, 0, 0, 0, 0, 0, 0, 0, 0, 0, 0, 0, 0, 0, 0, 0, 0, 0, 0, 0, 0, 0, 0, 0, 0, 0, 0, 0, 0, 0, 0, 0, 0, 0, 0, 0, 0, 0, 0, 0, 0, 0, 0, 0, 0, 0, 0, 0, 0, 0, 0, 0, 0, 0, 0, 0, 0, 0, 0, 0, 0, 0, 0, 0, 0, 0, 0, 0, 0, 0, 0, 0, 0, 0, 0, 0, 0, 0, 0, 0, 0, 0, 0, 0, 0, 0, 0, 0, 0, 0, 0, 0, 0, 0, 0, 0, 0, 0, 0, 0, 0, 0, 0, 0, 0, 0, 0, 0, 0, 0, 0, 0, 0, 0, 0, 0, 0, 0, 0, 0, 0, 0, 0, 0, 0, 0, 0, 14, 0, 0, 0, 0, 0, 0, 0, 0, 0, 0, 0, 0, 0, 0, 0, 0, 0, 0, 0, 0, 0, 0, 0, 0, 0, 0, 0, 0, 0, 0, 0, 0, 0, 0, 0, 0, 0, 0, 0, 0, 0, 0, 0, 0, 0, 0, 0, 0, 0, 0, 0, 0, 0, 0, 0, 0, 0, 0, 0, 0, 0, 0, 0, 0, 0, 0, 0, 0, 0, 0, 0, 0, 0, 0, 0, 0, 0, 0, 0, 0, 0, 0, 0, 0, 0, 0, 0, 0, 0, 0, 0, 0, 0, 0, 0, 0, 0, 0, 0, 0, 0, 0, 0, 0, 0, 0, 0, 0, 0, 0, 0, 0, 0, 0, 0, 0, 0, 0, 0, 0, 0, 0, 0, 0, 0, 0, 0, 0, 0, 0, 0, 0, 0, 0, 0, 0, 0, 0, 0, 0, 0, 0, 0, 0, 0, 0, 0, 0, 0, 0, 0, 0, 0, 0, 0, 0, 0, 0, 0, 0, 0, 0, 0, 0, 0, 0, 0, 0, 0, 0, 0, 0, 0, 0, 0, 0, 0, 0, 0, 0, 0, 0, 0, 0, 0, 0, 0, 0, 0, 0, 0, 0, 0, 0, 0, 0, 0, 0, 0, 0, 0, 0, 0, 0, 0, 0, 0, 0, 0, 0, 0, 0, 0, 0, 0, 0, 0, 0, 0, 0, 0, 0, 0, 0, 0, 0, 0, 0, 0, 0, 0, 0, 0, 0, 0, 0, 0, 0, 0, 0, 0, 0, 0, 0, 0, 0, 0, 0, 0, 0, 0, 0, 0, 0, 0, 0, 0, 0, 0, 0, 0, 0, 0, 0, 0, 0, 0, 0, 0, 0, 0, 0, 0, 0, 0, 0, 0, 0, 0, 0, 0, 0, 0, 0, 0, 0, 0, 0, 0, 0, 0, 0, 0, 0, 0, 0, 0, 0, 0, 0, 0, 0, 0, 0, 0, 0, 0, 0, 0, 0, 0, 0, 0, 0, 0, 0, 0, 0, 0, 0, 0, 0, 0, 0, 0, 0, 0, 0, 0, 0, 0, 0, 0, 0, 0, 0, 0, 0, 0, 0, 0, 0, 0, 0, 0, 0, 0, 0, 0, 0, 0, 0, 0, 0, 0, 0, 0, 0, 0, 0, 0, 0, 0, 0, 0, 0, 0, 0, 0, 0, 0, 0, 0, 0, 0, 0, 0, 0, 0, 0, 0, 0, 0, 0, 0, 0, 0, 0, 0, 0, 0, 0, 0, 0, 0, 0, 0, 0, 0, 0, 0, 0, 0, 0, 0, 0, 0, 0, 0, 0, 0, 0, 0, 0, 0, 0, 0, 0, 0, 0, 0, 0, 0, 0, 0, 0, 0, 0, 0, 0, 0, 0, 0, 0, 0, 0, 0, 0, 0, 0, 0, 0, 0, 0, 0, 0, 0, 0, 0, 0, 0, 0, 0, 0, 0, 0, 0, 0, 0, 0, 0, 0, 0, 0, 0, 0, 0, 0, 0, 0, 0, 0, 0, 0, 0, 0, 0, 0, 0, 0, 0, 0, 0, 0, 0, 0, 0, 0, 0, 0, 0, 0, 0, 0, 0, 0, 0, 0, 0, 0, 0, 0, 0, 0, 0, 0, 0, 0, 0, 0, 0, 0, 0, 0, 0, 0, 0, 0, 0, 0, 0, 0, 0, 0, 0, 0, 0, 0, 0, 0, 0, 0, 0, 0, 0, 0, 0, 0, 0, 0, 0, 0, 0, 0, 0, 0, 0, 0, 0, 0, 0, 0, 0, 0, 0, 0, 0, 0, 0, 0, 0, 0, 0, 0, 0, 0, 0, 0, 0, 0, 0, 0, 0, 0, 0, 0, 0, 0, 0, 0, 0, 0, 0, 0, 0, 0, 0, 0, 0, 0, 0, 0, 0, 0, 0, 0, 0, 0, 0, 0, 0, 0, 0, 0, 0, 0, 0, 0, 0, 0, 0, 0, 0, 0, 0, 0, 0, 0, 0, 0, 0, 0, 0, 0, 0, 0, 0, 0, 0, 0, 0, 0, 0, 0, 0, 0, 0, 0, 0, 0, 0, 0, 0, 0, 0, 0, 0, 0, 0, 0, 0, 0, 0, 0, 0, 0, 0, 0, 0, 0, 0, 0, 0, 0, 0, 0, 0, 0, 0, 0, 0, 0, 0, 0, 0, 0, 0, 0, 0, 0, 0, 0, 0, 0, 0, 0, 0, 0, 0, 0, 0, 0, 0, 0, 0, 0, 0, 0, 0, 0, 0, 0, 0, 0, 0, 0, 0, 0, 0, 0, 0, 0, 0, 0, 0, 0, 0, 0, 0, 0, 0, 0, 0, 0, 0, 0, 0, 0, 0, 0, 0, 0, 0, 0, 0, 0, 0, 0, 0, 0, 0, 0, 0, 0, 0, 0, 0, 0, 0, 0, 0, 0, 0, 0, 0, 0, 0, 0, 0, 0, 0, 0, 0, 0, 0, 0, 0, 0, 0, 0, 0, 0, 0, 0, 0, 0, 0, 0, 0, 0, 0, 0, 0, 0, 0, 0, 0, 0, 0, 0, 0, 0, 0, 0, 0, 0, 0, 0, 0, 0, 0, 0, 0, 0, 0, 0, 0, 0, 0, 0, 0, 0, 0, 0, 0, 0, 0, 0, 0, 0, 0, 0, 0, 0, 0, 0, 0, 0, 0, 0, 0, 0, 0, 0, 0, 0, 0, 0, 0, 0, 0, 0, 0, 0, 0, 0, 0, 0, 0, 0, 0, 0, 0, 0, 0, 0, 0, 0, 0, 0, 0, 0, 0, 0, 0, 0, 0, 0, 0, 0, 0, 0, 0, 0, 0, 0, 0, 0, 0, 0, 0, 0, 0, 0, 0, 0, 0, 0, 0, 0, 0, 0, 0, 0, 0, 0, 0, 0, 0, 0, 0, 0, 0, 0, 0, 0, 0, 0, 0, 0, 0, 0, 0, 0, 0, 0, 0, 0, 0, 0, 0, 0, 0, 0, 0, 0, 0, 0, 0, 0, 0, 0, 0, 0, 0, 0, 0, 0, 0, 0, 0, 0, 0, 0, 0, 0, 0, 0, 0, 0, 0, 0, 0, 0, 0, 0, 0, 0, 0, 0, 0, 0, 0, 0, 0, 0, 0, 0, 0, 0, 0, 0, 0, 0, 0, 0, 0, 0, 0, 0, 0, 0, 0, 0, 0, 0, 0, 0, 0, 0, 0, 0, 0, 0, 0, 0, 0, 0, 0, 0, 0, 0, 0, 0, 0, 0, 0, 0, 0, 0, 0, 0, 0, 0, 0, 0, 0, 0, 0, 0, 0, 0, 0, 0, 0, 0, 0, 0, 0, 0, 0, 0, 0, 0, 0, 0, 0, 0, 0, 0, 0, 0, 0, 0, 0, 0, 0, 0, 0, 0, 0, 0, 0, 0, 0, 0, 0, 0, 0, 0, 0, 0, 0, 0, 0, 0, 0, 0, 0, 0, 0, 0, 0, 0, 0, 0, 0, 0, 0, 0, 0, 0, 0, 0, 0, 0, 0, 0, 0, 0, 0, 0, 0, 0, 0, 0, 0, 0, 0, 0, 0, 0, 0, 0, 0, 0, 0, 0, 0],
         "height":40,
         "id":1,
         "name":"Kachelebene 1",
         "opacity":1,
         "type":"tilelayer",
         "visible":true,
         "width":55,
         "x":0,
         "y":0
        }, 
        {
         "id":8,
         "image":"background_exit.png",
         "name":"background",
         "opacity":1,
         "type":"imagelayer",
         "visible":true,
         "x":0,
         "y":0
        }, 
        {
         "draworder":"topdown",
         "id":2,
         "name":"Objektebene 1",
         "objects":[
                {
                 "gid":1,
                 "height":1640,
                 "id":5,
                 "name":"door",
                 "rotation":0,
                 "type":"",
                 "visible":true,
                 "width":1170,
                 "x":529,
                 "y":1908
                }, 
                {
                 "gid":4,
                 "height":1820,
                 "id":11,
                 "name":"shelve",
                 "properties":[
                        {
                         "name":"color",
                         "type":"string",
                         "value":"blue"
                        }],
                 "rotation":0,
                 "type":"",
                 "visible":true,
                 "width":1360,
                 "x":2176,
                 "y":2048
                }, 
                {
                 "gid":2,
                 "height":960,
                 "id":25,
                 "name":"flowerpot",
                 "properties":[
                        {
                         "name":"socket_requires",
                         "type":"string",
                         "value":"collectibleSoil"
                        }, 
                        {
                         "name":"socket_switch",
                         "type":"string",
                         "value":"flowerpot"
                        }, 
                        {
                         "name":"type",
                         "type":"string",
                         "value":"socket"
                        }],
                 "rotation":0,
                 "type":"",
                 "visible":true,
                 "width":550,
                 "x":36,
                 "y":2052
                }],
         "opacity":1,
         "type":"objectgroup",
         "visible":true,
         "x":0,
         "y":0
        }, 
        {
         "draworder":"topdown",
         "id":16,
         "name":"openDoor",
         "objects":[],
         "opacity":1,
         "type":"objectgroup",
         "visible":true,
         "x":0,
         "y":0
        }, 
        {
         "draworder":"topdown",
         "id":14,
         "name":"pot_with_soil",
         "objects":[
                {
                 "gid":26,
                 "height":960,
                 "id":46,
                 "name":"flowerPotWithSoil",
                 "properties":[
                        {
                         "name":"hidden",
                         "type":"bool",
                         "value":true
                        }, 
                        {
                         "name":"socket_requires",
                         "type":"string",
                         "value":"tomatoSeed"
                        }, 
                        {
                         "name":"socket_switch",
                         "type":"string",
                         "value":"flowerPotWithSoil"
                        }, 
                        {
                         "name":"type",
                         "type":"string",
                         "value":"socket"
                        }, 
                        {
                         "name":"visibilityToggleTarget",
                         "type":"string",
                         "value":"flowerpot"
                        }],
                 "rotation":0,
                 "type":"",
                 "visible":true,
                 "width":550,
                 "x":37,
                 "y":2052
                }],
         "opacity":1,
         "type":"objectgroup",
         "visible":true,
         "x":0,
         "y":0
        }, 
        {
         "draworder":"topdown",
         "id":15,
         "name":"pot_with_seed",
         "objects":[
                {
                 "gid":27,
                 "height":960,
                 "id":48,
                 "name":"flowerpotWithSeed",
                 "properties":[
                        {
                         "name":"hidden",
                         "type":"bool",
                         "value":true
                        }, 
                        {
                         "name":"socket_requires",
                         "type":"string",
                         "value":"bottleWithWater"
                        }, 
                        {
                         "name":"socket_switch",
                         "type":"string",
                         "value":"flowerpotWithSeed"
                        }, 
                        {
                         "name":"type",
                         "type":"string",
                         "value":"socket"
                        }, 
                        {
                         "name":"visibilityToggleTarget",
                         "type":"string",
                         "value":"flowerPotWithSoil"
                        }],
                 "rotation":0,
                 "type":"",
                 "visible":true,
                 "width":550,
                 "x":37,
                 "y":2052
                }],
         "opacity":1,
         "type":"objectgroup",
         "visible":true,
         "x":0,
         "y":0
        }, 
        {
         "draworder":"topdown",
         "id":12,
         "name":"chain_open",
         "objects":[
                {
                 "gid":24,
                 "height":1770,
                 "id":44,
                 "name":"chainOpen",
                 "properties":[
                        {
                         "name":"hidden",
                         "type":"bool",
                         "value":true
                        }, 
                        {
                         "name":"visibilityToggleTarget",
                         "type":"string",
                         "value":"chainClosed"
                        }],
                 "rotation":0,
                 "type":"",
                 "visible":true,
                 "width":1900,
                 "x":230,
                 "y":2269
                }],
         "opacity":1,
         "type":"objectgroup",
         "visible":true,
         "x":0,
         "y":0
        }, 
        {
         "draworder":"topdown",
         "id":13,
         "name":"chain_closed",
         "objects":[
                {
                 "gid":25,
                 "height":1200,
                 "id":45,
                 "name":"chainClosed",
                 "properties":[
                        {
                         "name":"socket_requires",
                         "type":"string",
                         "value":"chemicalBlack"
                        }, 
                        {
                         "name":"socket_switch",
                         "type":"string",
                         "value":"chainClosed"
                        }, 
                        {
                         "name":"type",
                         "type":"string",
                         "value":"socket"
                        }],
                 "rotation":0,
                 "type":"",
                 "visible":true,
                 "width":1520,
                 "x":364,
                 "y":1732
                }],
         "opacity":1,
         "type":"objectgroup",
         "visible":true,
         "x":0,
         "y":0
        }, 
        {
         "draworder":"topdown",
         "id":3,
         "name":"shelve_content",
         "objects":[
                {
                 "gid":5,
                 "height":883,
                 "id":13,
                 "name":"broom",
                 "properties":[
                        {
                         "name":"color",
                         "type":"string",
                         "value":"blue"
                        }, 
                        {
                         "name":"type",
                         "type":"string",
                         "value":"inventory"
                        }],
                 "rotation":0,
                 "type":"",
                 "visible":true,
                 "width":193,
                 "x":2942,
                 "y":1872
                }, 
                {
                 "gid":6,
                 "height":210,
                 "id":14,
                 "name":"tomatoSeed",
                 "properties":[
                        {
                         "name":"color",
                         "type":"string",
                         "value":"blue"
                        }, 
                        {
                         "name":"type",
                         "type":"string",
                         "value":"inventory"
                        }],
                 "rotation":0,
                 "type":"",
                 "visible":true,
                 "width":160,
                 "x":2634,
                 "y":1109
                }, 
                {
                 "gid":9,
                 "height":120,
                 "id":18,
                 "name":"tape",
                 "properties":[
                        {
                         "name":"color",
                         "type":"string",
                         "value":"blue"
                        }],
                 "rotation":0,
                 "type":"",
                 "visible":true,
                 "width":170,
                 "x":2496,
                 "y":1152
                }, 
                {
                 "gid":10,
                 "height":200,
                 "id":19,
                 "name":"ladiesRollerskate",
                 "properties":[
                        {
                         "name":"click_action",
                         "type":"string",
                         "value":"setMessage"
                        }, 
                        {
                         "name":"click_action_arg",
                         "type":"string",
                         "value":"Oh it's a rollerskate for ladies or someone else, who want wear high-heels"
                        }, 
                        {
                         "name":"color",
                         "type":"string",
                         "value":"red"
                        }, 
                        {
                         "name":"type",
                         "type":"string",
                         "value":"clickable"
                        }],
                 "rotation":0,
                 "type":"",
                 "visible":true,
                 "width":220,
                 "x":2579,
                 "y":1895
                }, 
                {
                 "gid":11,
                 "height":191,
                 "id":20,
                 "name":"modelShip",
                 "properties":[
                        {
                         "name":"color",
                         "type":"string",
                         "value":"blue"
                        }],
                 "rotation":0,
                 "type":"",
                 "visible":true,
                 "width":613,
                 "x":2521,
                 "y":744
                }, 
                {
                 "gid":12,
                 "height":240,
                 "id":22,
                 "name":"toiletPaper",
                 "properties":[
                        {
                         "name":"click_action",
                         "type":"string",
                         "value":"setMessage"
                        }, 
                        {
                         "name":"click_action_arg",
                         "type":"string",
                         "value":"Wonderful! A golden toilet paper! Now you feel like a king when you ... you know."
                        }, 
                        {
                         "name":"color",
                         "type":"string",
                         "value":"green"
                        }, 
                        {
                         "name":"type",
                         "type":"string",
                         "value":"clickable"
                        }],
                 "rotation":0,
                 "type":"",
                 "visible":true,
                 "width":290,
                 "x":2528,
                 "y":1477
                }],
         "opacity":1,
         "type":"objectgroup",
         "visible":true,
         "x":0,
         "y":0
        }, 
        {
         "draworder":"topdown",
         "id":10,
         "name":"shelve_content2",
         "objects":[
                {
                 "gid":21,
                 "height":330,
                 "id":39,
                 "name":"electricHammer",
                 "properties":[
                        {
                         "name":"click_action",
                         "type":"string",
                         "value":"setMessage"
                        }, 
                        {
                         "name":"click_action_arg",
                         "type":"string",
                         "value":"How convenient, a electric hammer!"
                        }, 
                        {
                         "name":"color",
                         "type":"string",
                         "value":"blue"
                        }, 
                        {
                         "name":"type",
                         "type":"string",
                         "value":"clickable"
                        }],
                 "rotation":0,
                 "type":"",
                 "visible":true,
                 "width":260,
                 "x":2498,
                 "y":1537
                }],
         "opacity":1,
         "type":"objectgroup",
         "visible":true,
         "x":0,
         "y":0
        }, 
        {
         "draworder":"topdown",
         "id":4,
         "name":"curtain",
         "objects":[
                {
                 "gid":8,
                 "height":1820,
                 "id":17,
                 "name":"curtain",
                 "properties":[
                        {
                         "name":"color",
                         "type":"string",
                         "value":"blue"
                        }, 
                        {
                         "name":"socket_switch",
                         "type":"string",
                         "value":"exit_curtain"
                        }, 
                        {
                         "name":"type",
                         "type":"string",
                         "value":"socket"
                        }],
                 "rotation":0,
                 "type":"",
                 "visible":true,
                 "width":1360,
                 "x":2176,
                 "y":2048
                }],
         "opacity":1,
         "type":"objectgroup",
         "visible":false,
         "x":0,
         "y":0
        }, 
        {
         "draworder":"topdown",
         "id":5,
         "name":"tomato_plant",
         "objects":[
                {
                 "gid":7,
                 "height":960,
                 "id":15,
                 "name":"tomatoPlant",
                 "properties":[
                        {
                         "name":"hidden",
                         "type":"bool",
                         "value":true
                        }, 
                        {
                         "name":"visibilityToggleTarget",
                         "type":"string",
                         "value":"flowerpotWithSeed"
                        }],
                 "rotation":0,
                 "type":"",
                 "visible":true,
                 "width":550,
                 "x":-64,
                 "y":2048
                }, 
                {
                 "gid":3,
                 "height":670,
                 "id":9,
                 "name":"soil",
                 "properties":[
                        {
                         "name":"click_action",
                         "type":"string",
                         "value":"setMessage"
                        }, 
                        {
                         "name":"click_action_arg",
                         "type":"string",
                         "value":"Perhaps someone wanted to plant something?"
                        }, 
                        {
                         "name":"type",
                         "type":"string",
                         "value":"clickable"
                        }],
                 "rotation":0,
                 "type":"",
                 "visible":true,
                 "width":1030,
                 "x":1423,
                 "y":2207
                }],
         "offsetx":100,
         "offsety":4,
         "opacity":1,
         "type":"objectgroup",
         "visible":true,
         "x":0,
         "y":0
        }, 
        {
         "draworder":"topdown",
         "id":6,
         "name":"collectibleSoil",
         "objects":[
                {
                 "gid":13,
                 "height":280,
                 "id":26,
                 "name":"collectibleSoil",
                 "properties":[
                        {
                         "name":"type",
                         "type":"string",
                         "value":"inventory"
                        }],
                 "rotation":0,
                 "type":"",
                 "visible":true,
                 "width":530,
                 "x":2019,
                 "y":2192
                }, 
                {
                 "gid":20,
                 "height":980,
                 "id":37,
                 "name":"trombone",
                 "properties":[
                        {
                         "name":"click_action",
                         "type":"string",
                         "value":"toggleMusic"
                        }, 
                        {
                         "name":"click_action_arg",
                         "type":"string",
                         "value":"trombones"
                        }, 
                        {
                         "name":"color",
                         "type":"string",
                         "value":"green"
                        }, 
                        {
                         "name":"type",
                         "type":"string",
                         "value":"clickable"
                        }],
                 "rotation":0,
                 "type":"",
                 "visible":true,
                 "width":390,
                 "x":1777,
                 "y":1302
                }],
         "opacity":1,
         "type":"objectgroup",
         "visible":true,
         "x":0,
         "y":0
        }, 
        {
         "draworder":"topdown",
         "id":9,
         "name":"pet",
         "objects":[
                {
                 "gid":17,
                 "height":440,
                 "id":30,
                 "name":"petRock",
                 "properties":[
                        {
                         "name":"click_action",
                         "type":"string",
                         "value":"setMessage"
                        }, 
                        {
                         "name":"click_action_arg",
                         "type":"string",
                         "value":"Don't touch it! The pet rock is sleeping!"
                        }, 
                        {
                         "name":"type",
                         "type":"string",
                         "value":"clickable"
                        }],
                 "rotation":0,
                 "type":"",
                 "visible":true,
                 "width":790,
                 "x":2697,
                 "y":2180
                }, 
                {
                 "gid":18,
                 "height":290,
                 "id":35,
                 "name":"hat",
                 "properties":[
                        {
                         "name":"click_action",
                         "type":"string",
                         "value":"setMessage"
                        }, 
                        {
                         "name":"click_action_arg",
                         "type":"string",
                         "value":"A fancy hat. It's better to wear a hat when the sun is shining."
                        }, 
                        {
                         "name":"type",
                         "type":"string",
                         "value":"clickable"
                        }],
                 "rotation":0,
                 "type":"",
                 "visible":true,
                 "width":370,
                 "x":1903,
                 "y":1721
                }, 
                {
                 "gid":19,
                 "height":270,
                 "id":36,
                 "name":"pizzaBelt",
                 "properties":[
                        {
                         "name":"click_action",
                         "type":"string",
                         "value":"setMessage"
                        }, 
                        {
                         "name":"click_action_arg",
                         "type":"string",
                         "value":"How nice, a pizza-belt! Now you can eat pizza always and everywhere!"
                        }, 
                        {
                         "name":"color",
                         "type":"string",
                         "value":"red"
                        }, 
                        {
                         "name":"type",
                         "type":"string",
                         "value":"clickable"
                        }],
                 "rotation":0,
                 "type":"",
                 "visible":true,
                 "width":500,
                 "x":1530,
                 "y":2247
                }, 
                {
                 "gid":23,
                 "height":380,
                 "id":42,
                 "name":"frog",
                 "properties":[
                        {
                         "name":"color",
                         "type":"string",
                         "value":"green"
                        }, 
                        {
                         "name":"type",
                         "type":"string",
                         "value":"inventory"
                        }],
                 "rotation":0,
                 "type":"",
                 "visible":true,
                 "width":380,
                 "x":1098,
                 "y":2398
                }],
         "opacity":1,
         "type":"objectgroup",
         "visible":true,
         "x":0,
         "y":0
        }, 
        {
         "draworder":"topdown",
         "id":11,
         "name":"more_objects",
         "objects":[
                {
                 "gid":22,
                 "height":260,
                 "id":41,
                 "name":"petRuffler",
                 "properties":[
                        {
                         "name":"click_action",
                         "type":"string",
                         "value":"setMessage"
                        }, 
                        {
                         "name":"click_action_arg",
                         "type":"string",
                         "value":"It's the latest model of the \"Pet Ruffler 2000\"! Now you never have to touch your pets again!"
                        }, 
                        {
                         "name":"type",
                         "type":"string",
                         "value":"clickable"
                        }],
                 "rotation":0,
                 "type":"",
                 "visible":true,
                 "width":360,
                 "x":2612,
                 "y":2142
                }, 
                {
                 "gid":30,
                 "height":170,
                 "id":55,
                 "name":"tomato",
                 "properties":[
                        {
                         "name":"hidden",
                         "type":"bool",
                         "value":true
                        }, 
                        {
                         "name":"type",
                         "type":"string",
                         "value":"inventory"
                        }, 
                        {
                         "name":"visibilityToggleTarget",
                         "type":"string",
                         "value":"flowerpotWithSeed"
                        }],
                 "rotation":0,
                 "type":"",
                 "visible":true,
                 "width":170,
                 "x":143,
                 "y":1663
                }, 
                {
                 "gid":31,
                 "height":250,
                 "id":56,
                 "name":"squashedTomato",
                 "properties":[
                        {
                         "name":"hidden",
                         "type":"bool",
                         "value":true
                        }, 
                        {
                         "name":"type",
                         "type":"string",
                         "value":"inventory"
                        }, 
                        {
                         "name":"visibilityToggleTarget",
                         "type":"string",
                         "value":"flowerpotWithSeed"
                        }],
                 "rotation":0,
                 "type":"",
                 "visible":true,
                 "width":250,
                 "x":347,
                 "y":2121
                }],
         "opacity":1,
         "type":"objectgroup",
         "visible":true,
         "x":0,
         "y":0
        }, 
        {
         "draworder":"topdown",
         "id":7,
         "name":"arows",
         "objects":[
                {
                 "gid":15,
                 "height":330,
                 "id":28,
                 "name":"arrowRight",
                 "properties":[
                        {
                         "name":"click_action",
                         "type":"string",
                         "value":"navigateTo"
                        }, 
                        {
                         "name":"click_action_arg",
                         "type":"string",
                         "value":"kitchen"
                        }, 
                        {
                         "name":"type",
                         "type":"string",
                         "value":"clickable"
                        }],
                 "rotation":0,
                 "type":"",
                 "visible":true,
                 "width":330,
                 "x":3163,
                 "y":1284
                }, 
                {
                 "gid":16,
                 "height":330,
                 "id":29,
                 "name":"arrowLeft",
                 "properties":[
                        {
                         "name":"click_action",
                         "type":"string",
                         "value":"navigateTo"
                        }, 
                        {
                         "name":"click_action_arg",
                         "type":"string",
                         "value":"desk"
                        }, 
                        {
                         "name":"type",
                         "type":"string",
                         "value":"clickable"
                        }],
                 "rotation":0,
                 "type":"",
                 "visible":true,
                 "width":330,
                 "x":23,
                 "y":1284
                }, 
                {
                 "gid":29,
                 "height":200,
                 "id":51,
                 "name":"exitArrow",
                 "properties":[
                        {
                         "name":"click_action",
                         "type":"string",
                         "value":"navigateTo"
                        }, 
                        {
                         "name":"click_action_arg",
                         "type":"string",
                         "value":"endScreen"
                        }, 
                        {
                         "name":"hidden",
                         "type":"bool",
                         "value":true
                        }, 
                        {
                         "name":"type",
                         "type":"string",
                         "value":"clickable"
                        }, 
                        {
                         "name":"visibilityToggleTarget",
                         "type":"string",
                         "value":"chainClosed"
                        }],
                 "rotation":0,
                 "type":"",
                 "visible":true,
                 "width":240,
                 "x":996,
                 "y":1688
                }],
         "opacity":1,
         "type":"objectgroup",
         "visible":true,
         "x":0,
         "y":0
        }],
 "nextlayerid":17,
 "nextobjectid":58,
 "orientation":"orthogonal",
 "renderorder":"right-down",
 "tiledversion":"1.2.4",
 "tileheight":64,
 "tilesets":[
        {
         "columns":1,
         "firstgid":1,
         "image":"door_closed.png",
         "imageheight":1640,
         "imagewidth":1170,
         "margin":0,
         "name":"door_closed",
         "spacing":0,
         "tilecount":1,
         "tileheight":1640,
         "tilewidth":1170
        }, 
        {
         "columns":1,
         "firstgid":2,
         "image":"flowerpot_empty.png",
         "imageheight":960,
         "imagewidth":550,
         "margin":0,
         "name":"flowerpot_empty",
         "spacing":0,
         "tilecount":1,
         "tileheight":960,
         "tilewidth":550
        }, 
        {
         "columns":1,
         "firstgid":3,
         "image":"soil.png",
         "imageheight":670,
         "imagewidth":1030,
         "margin":0,
         "name":"soil",
         "spacing":0,
         "tilecount":1,
         "tileheight":670,
         "tilewidth":1030
        }, 
        {
         "columns":1,
         "firstgid":4,
         "image":"shelve.png",
         "imageheight":1820,
         "imagewidth":1360,
         "margin":0,
         "name":"shelve",
         "spacing":0,
         "tilecount":1,
         "tileheight":1820,
         "tilewidth":1360
        }, 
        {
         "columns":1,
         "firstgid":5,
         "image":"broom.png",
         "imageheight":883,
         "imagewidth":193,
         "margin":0,
         "name":"broom",
         "spacing":0,
         "tilecount":1,
         "tileheight":883,
         "tilewidth":193
        }, 
        {
         "columns":1,
         "firstgid":6,
         "image":"tomato_seed.png",
         "imageheight":210,
         "imagewidth":160,
         "margin":0,
         "name":"tomato_seed",
         "spacing":0,
         "tilecount":1,
         "tileheight":210,
         "tilewidth":160
        }, 
        {
         "columns":1,
         "firstgid":7,
         "image":"tomato_plant.png",
         "imageheight":960,
         "imagewidth":550,
         "margin":0,
         "name":"tomato_plant",
         "spacing":0,
         "tilecount":1,
         "tileheight":960,
         "tilewidth":550
        }, 
        {
         "columns":1,
         "firstgid":8,
         "image":"shelve_with_curtain.png",
         "imageheight":1820,
         "imagewidth":1360,
         "margin":0,
         "name":"shelve_with_curtain",
         "spacing":0,
         "tilecount":1,
         "tileheight":1820,
         "tilewidth":1360
        }, 
        {
         "columns":1,
         "firstgid":9,
         "image":"tape.png",
         "imageheight":120,
         "imagewidth":170,
         "margin":0,
         "name":"tape",
         "spacing":0,
         "tilecount":1,
         "tileheight":120,
         "tilewidth":170
        }, 
        {
         "columns":1,
         "firstgid":10,
         "image":"ladies_roller_skate.png",
         "imageheight":200,
         "imagewidth":220,
         "margin":0,
         "name":"ladies_roller_skate",
         "spacing":0,
         "tilecount":1,
         "tileheight":200,
         "tilewidth":220
        }, 
        {
         "columns":1,
         "firstgid":11,
         "image":"model_ship.png",
         "imageheight":272,
         "imagewidth":878,
         "margin":0,
         "name":"model_ship",
         "spacing":0,
         "tilecount":1,
         "tileheight":272,
         "tilewidth":878
        }, 
        {
         "columns":1,
         "firstgid":12,
         "image":"toilettpaper_gold.png",
         "imageheight":240,
         "imagewidth":290,
         "margin":0,
         "name":"toilettpaper_gold",
         "spacing":0,
         "tilecount":1,
         "tileheight":240,
         "tilewidth":290
        }, 
        {
         "columns":1,
         "firstgid":13,
         "image":"soil_to_collect.png",
         "imageheight":280,
         "imagewidth":530,
         "margin":0,
         "name":"soil_to_collect",
         "spacing":0,
         "tilecount":1,
         "tileheight":280,
         "tilewidth":530
        }, 
        {
         "columns":1,
         "firstgid":14,
         "image":"arrow_right.png",
         "imageheight":330,
         "imagewidth":330,
         "margin":0,
         "name":"arrow_right",
         "spacing":0,
         "tilecount":1,
         "tileheight":330,
         "tilewidth":330
        }, 
        {
         "columns":1,
         "firstgid":15,
         "image":"arrow_right.png",
         "imageheight":330,
         "imagewidth":330,
         "margin":0,
         "name":"arrow_right",
         "spacing":0,
         "tilecount":1,
         "tileheight":330,
         "tilewidth":330
        }, 
        {
         "columns":1,
         "firstgid":16,
         "image":"arrow_left.png",
         "imageheight":330,
         "imagewidth":330,
         "margin":0,
         "name":"arrow_left",
         "spacing":0,
         "tilecount":1,
         "tileheight":330,
         "tilewidth":330
        }, 
        {
         "columns":1,
         "firstgid":17,
         "image":"pet_rock.png",
         "imageheight":440,
         "imagewidth":790,
         "margin":0,
         "name":"pet_rock",
         "spacing":0,
         "tilecount":1,
         "tileheight":440,
         "tilewidth":790
        }, 
        {
         "columns":1,
         "firstgid":18,
         "image":"hat.png",
         "imageheight":290,
         "imagewidth":370,
         "margin":0,
         "name":"hat",
         "spacing":0,
         "tilecount":1,
         "tileheight":290,
         "tilewidth":370
        }, 
        {
         "columns":1,
         "firstgid":19,
         "image":"pizza_belt.png",
         "imageheight":270,
         "imagewidth":500,
         "margin":0,
         "name":"pizza_belt",
         "spacing":0,
         "tilecount":1,
         "tileheight":270,
         "tilewidth":500
        }, 
        {
         "columns":1,
         "firstgid":20,
         "image":"trombone.png",
         "imageheight":980,
         "imagewidth":390,
         "margin":0,
         "name":"trombone",
         "spacing":0,
         "tilecount":1,
         "tileheight":980,
         "tilewidth":390
        }, 
        {
         "columns":1,
         "firstgid":21,
         "image":"electric_hammer.png",
         "imageheight":330,
         "imagewidth":260,
         "margin":0,
         "name":"electric_hammer",
         "spacing":0,
         "tilecount":1,
         "tileheight":330,
         "tilewidth":260
        }, 
        {
         "columns":1,
         "firstgid":22,
         "image":"pet_ruffler.png",
         "imageheight":260,
         "imagewidth":360,
         "margin":0,
         "name":"pet_ruffler",
         "spacing":0,
         "tilecount":1,
         "tileheight":260,
         "tilewidth":360
        }, 
        {
         "columns":1,
         "firstgid":23,
         "image":"frog.png",
         "imageheight":380,
         "imagewidth":380,
         "margin":0,
         "name":"frog",
         "spacing":0,
         "tilecount":1,
         "tileheight":380,
         "tilewidth":380
        }, 
        {
         "columns":1,
         "firstgid":24,
         "image":"chain_open.png",
         "imageheight":1770,
         "imagewidth":1900,
         "margin":0,
         "name":"chain_open",
         "spacing":0,
         "tilecount":1,
         "tileheight":1770,
         "tilewidth":1900
        }, 
        {
         "columns":1,
         "firstgid":25,
         "image":"chain_closed.png",
         "imageheight":1200,
         "imagewidth":1520,
         "margin":0,
         "name":"chain_closed",
         "spacing":0,
         "tilecount":1,
         "tileheight":1200,
         "tilewidth":1520
        }, 
        {
         "columns":1,
         "firstgid":26,
         "image":"flowerpot_with_soil.png",
         "imageheight":960,
         "imagewidth":550,
         "margin":0,
         "name":"flowerpot_with_soil",
         "spacing":0,
         "tilecount":1,
         "tileheight":960,
         "tilewidth":550
        }, 
        {
         "columns":1,
         "firstgid":27,
         "image":"flowerpot_with_seed.png",
         "imageheight":960,
         "imagewidth":550,
         "margin":0,
         "name":"flowerpot_with_seed",
         "spacing":0,
         "tilecount":1,
         "tileheight":960,
         "tilewidth":550
        }, 
        {
         "columns":1,
         "firstgid":28,
         "image":"open_door.png",
         "imageheight":1640,
         "imagewidth":1170,
         "margin":0,
         "name":"open_door",
         "spacing":0,
         "tilecount":1,
         "tileheight":1640,
         "tilewidth":1170
        }, 
        {
         "columns":1,
         "firstgid":29,
         "image":"exit_arrow.png",
         "imageheight":200,
         "imagewidth":240,
         "margin":0,
         "name":"exit_arrow",
         "spacing":0,
         "tilecount":1,
         "tileheight":200,
         "tilewidth":240
        }, 
        {
         "columns":1,
         "firstgid":30,
         "image":"tomato.png",
         "imageheight":170,
         "imagewidth":170,
         "margin":0,
         "name":"tomato",
         "spacing":0,
         "tilecount":1,
         "tileheight":170,
         "tilewidth":170
        }, 
        {
         "columns":1,
         "firstgid":31,
         "image":"squashed_tomato.png",
         "imageheight":250,
         "imagewidth":250,
         "margin":0,
         "name":"squashed_tomato",
         "spacing":0,
         "tilecount":1,
         "tileheight":250,
         "tilewidth":250
        }, 
        {
         "columns":1,
         "firstgid":32,
         "image":"sugarblue.png",
         "imageheight":340,
         "imagewidth":270,
         "margin":0,
         "name":"sugarblue",
         "spacing":0,
         "tilecount":1,
         "tileheight":340,
         "tilewidth":270
        }],
 "tilewidth":64,
 "type":"map",
 "version":1.2,
 "width":55
}