{ "height":20,
 "infinite":false,
 "layers":[
        {
         "data":[0, 0, 0, 0, 0, 0, 0, 0, 0, 0, 0, 0, 0, 0, 0, 0, 0, 0, 0, 0, 0, 0, 0, 0, 0, 0, 0, 0, 0, 115, 116, 117, 118, 119, 120, 121, 122, 123, 124, 125, 0, 0, 115, 115, 115, 115, 115, 115, 116, 117, 118, 119, 120, 121, 122, 123, 124, 125, 125, 123, 0, 115, 115, 116, 117, 118, 119, 120, 115, 116, 117, 118, 119, 120, 121, 122, 123, 124, 125, 121, 115, 116, 117, 118, 119, 120, 121, 122, 123, 115, 116, 117, 118, 119, 120, 121, 122, 123, 124, 125, 115, 116, 117, 118, 119, 120, 121, 122, 123, 124, 115, 116, 117, 118, 119, 120, 121, 122, 123, 124, 115, 116, 117, 118, 119, 120, 121, 122, 123, 124, 115, 116, 117, 118, 119, 120, 121, 122, 123, 124, 115, 116, 117, 118, 119, 120, 121, 122, 123, 124, 115, 116, 117, 118, 119, 120, 121, 122, 123, 124, 116, 115, 116, 117, 118, 119, 120, 121, 122, 123, 115, 116, 117, 118, 119, 120, 121, 122, 123, 124, 116, 115, 116, 117, 118, 119, 120, 121, 122, 123, 115, 116, 117, 118, 119, 120, 121, 122, 123, 124, 116, 115, 116, 117, 118, 119, 120, 121, 122, 123, 115, 116, 117, 118, 119, 120, 121, 122, 123, 124, 116, 115, 116, 117, 118, 119, 120, 121, 122, 123, 115, 116, 117, 118, 119, 120, 121, 122, 123, 124, 115, 115, 116, 117, 118, 119, 120, 121, 115, 116, 115, 116, 117, 118, 119, 120, 121, 122, 123, 124, 0, 0, 115, 116, 117, 118, 119, 115, 116, 117, 115, 116, 117, 118, 119, 120, 121, 122, 123, 124, 0, 0, 0, 115, 115, 115, 115, 116, 117, 118, 115, 115, 116, 117, 118, 119, 120, 121, 122, 123, 0, 0, 0, 0, 0, 0, 0, 0, 0, 0, 0, 0, 115, 116, 117, 118, 119, 120, 121, 122, 0, 0, 0, 0, 0, 0, 0, 0, 0, 0, 0, 0, 115, 116, 117, 118, 119, 120, 121, 122, 0, 0, 0, 0, 0, 0, 0, 0, 115, 115, 115, 116, 117, 118, 119, 120, 121, 122, 123, 124, 0, 0, 0, 0, 0, 0, 115, 115, 116, 117, 118, 115, 116, 117, 118, 119, 120, 121, 122, 123, 0, 0, 0, 0, 0, 0, 115, 116, 117, 118, 119, 120, 121, 122, 123, 124, 125, 125, 125, 125],
         "height":20,
         "id":3,
         "name":"first layer",
         "opacity":1,
         "type":"tilelayer",
         "visible":true,
         "width":20,
         "x":0,
         "y":0
        }, 
        {
         "data":[0, 0, 3362, 3362, 3407, 3408, 836, 837, 838, 1558, 1558, 0, 0, 0, 0, 0, 0, 0, 0, 0, 0, 0, 3407, 3407, 3408, 836, 837, 838, 1558, 1558, 0, 0, 0, 0, 0, 0, 0, 0, 0, 0, 0, 0, 3407, 3408, 836, 837, 838, 1558, 1558, 0, 0, 0, 0, 0, 0, 0, 0, 0, 0, 0, 0, 0, 3407, 3408, 836, 837, 838, 1558, 0, 0, 0, 0, 0, 0, 0, 0, 0, 0, 0, 0, 0, 0, 3407, 3408, 836, 837, 838, 1558, 1558, 0, 0, 0, 0, 0, 0, 0, 0, 0, 0, 0, 0, 0, 3407, 3408, 3363, 836, 837, 838, 1558, 1558, 1558, 0, 0, 0, 0, 0, 0, 0, 0, 0, 0, 0, 3407, 3408, 3408, 3363, 836, 837, 838, 783, 1558, 0, 0, 0, 0, 0, 0, 0, 0, 0, 0, 0, 0, 3407, 3408, 3408, 0, 836, 837, 838, 1558, 0, 0, 0, 0, 0, 0, 0, 0, 0, 0, 0, 0, 3362, 3407, 3408, 781, 836, 837, 838, 1558, 0, 0, 0, 0, 0, 0, 0, 0, 0, 0, 0, 3362, 3407, 3407, 3408, 836, 836, 837, 1558, 1558, 0, 0, 0, 0, 0, 0, 0, 0, 0, 0, 0, 3407, 3407, 3408, 837, 838, 1558, 1558, 1558, 0, 0, 0, 0, 0, 0, 0, 0, 0, 0, 0, 3362, 3407, 3408, 836, 837, 838, 1558, 1558, 1558, 0, 0, 0, 0, 0, 0, 0, 0, 0, 0, 0, 3407, 3407, 3408, 837, 838, 783, 783, 783, 1558, 1558, 1558, 0, 0, 0, 0, 0, 0, 0, 0, 0, 3407, 3408, 3408, 837, 838, 838, 838, 838, 838, 838, 1558, 0, 0, 0, 0, 0, 0, 0, 0, 0, 0, 3407, 3408, 3363, 3363, 0, 781, 836, 837, 1558, 1558, 0, 0, 0, 0, 0, 0, 0, 0, 0, 0, 3407, 3408, 3408, 3408, 781, 836, 836, 1558, 1558, 0, 0, 0, 0, 0, 0, 0, 0, 0, 0, 0, 3407, 3407, 3408, 836, 836, 837, 1558, 1558, 0, 0, 0, 0, 0, 0, 0, 0, 0, 0, 0, 0, 3407, 3408, 836, 837, 838, 1558, 1558, 0, 0, 0, 0, 0, 0, 0, 0, 0, 0, 0, 0, 0, 3407, 3408, 836, 837, 1558, 1558, 0, 0, 0, 0, 0, 0, 0, 0, 0, 0, 0, 0, 0, 0, 3407, 3408, 836, 837, 1558, 0, 0, 0, 0, 0, 0, 0, 0, 0, 0, 0, 0, 0],
         "height":20,
         "id":4,
         "name":"second layer",
         "opacity":1,
         "type":"tilelayer",
         "visible":true,
         "width":20,
         "x":0,
         "y":0
        }, 
        {
         "data":[0, 0, 0, 0, 0, 0, 0, 0, 0, 0, 0, 0, 0, 0, 0, 0, 0, 0, 0, 0, 0, 0, 0, 0, 0, 0, 0, 0, 0, 0, 0, 0, 0, 0, 0, 0, 0, 0, 0, 0, 0, 0, 0, 0, 0, 0, 0, 0, 0, 0, 0, 0, 0, 0, 0, 0, 0, 0, 0, 0, 0, 0, 0, 0, 0, 0, 0, 0, 0, 0, 0, 0, 0, 0, 0, 0, 0, 0, 0, 0, 0, 0, 0, 0, 0, 0, 0, 0, 0, 0, 0, 0, 0, 0, 0, 0, 0, 0, 0, 0, 0, 0, 0, 0, 0, 0, 0, 0, 0, 0, 0, 0, 0, 0, 0, 0, 0, 0, 0, 0, 0, 0, 0, 0, 0, 0, 0, 0, 0, 0, 0, 0, 0, 0, 0, 0, 0, 0, 0, 0, 0, 0, 0, 0, 0, 0, 0, 0, 0, 0, 0, 0, 0, 0, 0, 0, 0, 0, 0, 0, 0, 0, 0, 0, 0, 0, 0, 0, 0, 0, 0, 0, 0, 0, 0, 0, 0, 0, 0, 0, 0, 0, 0, 0, 0, 0, 0, 0, 0, 0, 0, 0, 0, 0, 0, 0, 0, 0, 0, 0, 0, 0, 0, 0, 0, 0, 0, 0, 0, 0, 0, 0, 0, 0, 0, 0, 0, 0, 0, 0, 0, 0, 0, 0, 0, 0, 0, 0, 0, 0, 0, 0, 0, 0, 0, 0, 0, 0, 0, 0, 2694, 0, 0, 0, 0, 2825, 2826, 2827, 0, 0, 0, 0, 0, 0, 0, 0, 0, 0, 0, 0, 2739, 2694, 2825, 2824, 2824, 2825, 2826, 2827, 2828, 0, 0, 0, 0, 2824, 2824, 2825, 2826, 2827, 0, 0, 2738, 2739, 2830, 2831, 2832, 2833, 2834, 2824, 2824, 2869, 2824, 2824, 2824, 2869, 2824, 2825, 2826, 2827, 2828, 2829, 2828, 2829, 2830, 2831, 2832, 2833, 2834, 2831, 2832, 2833, 2834, 2869, 2869, 2869, 2824, 2825, 2826, 2827, 2828, 2829, 2827, 2828, 2829, 2830, 2831, 2832, 2833, 2834, 2832, 2833, 2834, 2834, 2834, 2872, 2824, 2825, 2826, 2827, 2828, 2829, 2827, 2828, 2829, 2830, 2831, 2832, 2833, 2834, 2824, 2824, 2824, 2824, 2824, 2825, 2826, 2827, 2828, 2829, 2830, 2831, 2825, 2826, 2827, 2828, 2824, 2824, 2824, 2824, 2869, 2869, 2869, 2869, 2869, 2870, 2871, 2872, 2873, 2874, 2875, 2876, 2824, 2824, 2824, 2824, 2869, 2869, 2869, 2869, 2870, 2871, 2872, 2873, 2874, 2875, 2876, 2877, 2878, 2879, 2878, 2879],
         "height":20,
         "id":5,
         "name":"third layer",
         "opacity":1,
         "type":"tilelayer",
         "visible":true,
         "width":20,
         "x":0,
         "y":0
        }],
 "nextlayerid":6,
 "nextobjectid":1,
 "orientation":"orthogonal",
 "renderorder":"right-down",
 "tiledversion":"1.2.3",
 "tileheight":32,
 "tilesets":[
        {
         "columns":55,
         "firstgid":1,
         "image":"..\/tilesets\/tileset-1.png",
         "imageheight":1550,
         "imagewidth":1778,
         "margin":0,
         "name":"tileset-1",
         "spacing":0,
         "tilecount":2640,
         "tileheight":32,
         "tilewidth":32
        }, 
        {
         "columns":45,
         "firstgid":2641,
         "image":"..\/tilesets\/tileset-2.png",
         "imageheight":1342,
         "imagewidth":1440,
         "margin":0,
         "name":"tileset-2",
         "spacing":0,
         "tilecount":1845,
         "tileheight":32,
         "tilewidth":32
        }],
 "tilewidth":32,
 "type":"map",
 "version":1.2,
 "width":20
}