{
  "aka-oni": {
    "elements": ["fire", "earth"]
  },
  "ao-oni": {
    "elements": ["water", "earth"]
  },
  "blub": {
    "elements": ["water"]
  },
  "byakko": {
    "elements": []
  },
  "cloud": {
    "elements": ["air"]
  },
  "fire": {
    "elements": ["fire"]
  },
  "fox-girl": {
    "elements": ["wood"]
  },
  "fuujin": {
    "elements": ["air"]
  },
  "genbu": {
    "elements": ["earth", "wood"]
  },
  "karasu-tengu": {
    "elements": ["air"]
  },
  "komainu": {
    "elements": ["fire"]
  },
  "log": {
    "elements": ["wood"]
  },
  "raijin": {
    "elements": ["air"]
  },
  "seiryu": {
    "elements": ["ice", "air"]
  },
  "suzaku": {
    "elements": ["fire", "air"]
  },
  "tsuchinoko": {
    "elements": ["earth"]
  },
  "yuki-onna": {
    "elements": ["ice"]
  }
}
