{
  "json": {
  },
  "markdown": {
  },
  "toml": {
  },
  "dockerfile": {
  },
  "includes": ["**/*.{toml}"],
  "excludes": [
    "**/*-lock.json"
  ],
  "plugins": [
    "https://plugins.dprint.dev/json-0.17.0.wasm",
    "https://plugins.dprint.dev/markdown-0.15.2.wasm",
    "https://plugins.dprint.dev/toml-0.5.4.wasm",
    "https://plugins.dprint.dev/dockerfile-0.3.0.wasm"
  ]
}
