{
  "variables": {
    "tag": "{{env `CI_COMMIT_TAG`}}",
    "short_sha": "{{env `CI_COMMIT_SHORT_SHA`}}",
    "volume_fs": "ext4"
  },
  "builders": [
    {
      "type": "amazon-ebs",
      "source_ami_filter": {
        "filters": {
          "virtualization-type": "hvm",
          "name": "debian-10-amd64-*",
          "root-device-type": "ebs"
        },
        "owners": [
          "136693071363"
        ],
        "most_recent": true
      },
      "region": "eu-west-1",
      "instance_type": "t3a.small",
      "security_group_id": "sg-xxxxxxxxxxxxxxxxx",
      "ssh_username": "admin",
      "ami_name": "playbook {{user `tag`}} {{user `short_sha`}}",
      "iam_instance_profile": "DefaultVPCLockdown",
      "force_deregister": true,
      "force_delete_snapshot": true,
      "tags": {
        "Name": "playbook",
        "OS_Version": "Debian",
        "Release": "Buster"
      }
    }
  ],
  "provisioners": [
    {
      "type": "shell",
      "inline": [
        "sudo apt-get update -y",
        "sudo apt-get autoremove -y",
        "sudo DEBIAN_FRONTEND=noninteractive apt-get upgrade -y"
      ]
    },
    {
      "type": "ansible",
      "playbook_file": "./packer-playbook.yml",
      "ansible_env_vars": [
        "ANSIBLE_HOST_KEY_CHECKING=False",
        "ANSIBLE_SSH_ARGS='-C -o ControlPersist=no'",
        "ANSIBLE_NOCOLOR=True"
      ]
    }
  ],
  "post-processors": [
    {
      "type": "manifest",
      "output": "manifest.json",
      "strip_path": true
    }
  ]
}
