{
    "status": 200,
    "message": "books - skip: 0; limit: 10",
    "content": {
        "count": 3,
        "skip": 0,
        "limit": 10,
        "results": [
            {
                "id": 1,
                "title": "Golang is great",
                "author": "Mr. Great",
                "year": "2012"
            },
            {
                "id": 2,
                "title": "C++ is greatest",
                "author": "Mr. C++",
                "year": "2015"
            },
            {
                "id": 3,
                "title": "C++ is very old",
                "author": "Mr. Old",
                "year": "2014"
            }
        ]
    }
}