{
    "Matrix": {
        "status": 201,
        "message": "book: 4 created",
        "content": {
            "id": 4
        }
    },
    "notOK":{
        "status": 406,
        "message": "admin: account already exists",
        "error": {}
    }
}
