{
  "openapi": "3.0.0",
  "servers": [
    {
      "description": "Development API endpoint",
      "url": "http://localhost:8883/v1"
    },
    {
      "description": "K3d API endpoint",
      "url": "http://localhost:30783/v1"
    },
    {
      "description": "Private API endpoint",
      "url": "http://book-admin/v1"
    },
    {
      "description": "Development API Gateway endpoint",
      "url": "http://localhost:8881/book-admin/v1"
    }
  ],
  "info": {
    "description": "This is a simple API",
    "version": "1.0.0",
    "title": "book-admin",
    "contact": {
      "email": "atulodzi@gmail.com"
    },
    "license": {
      "name": "Apache 2.0",
      "url": "https://www.apache.org/licenses/LICENSE-2.0.html"
    }
  },
  "tags": [
    {
      "name": "health",
      "description": "Health endpoints"
    },
    {
      "name": "book-admin",
      "description": "BookAdmin related endpoints"
    }
  ],
  "paths": {
    "/health": {
      "get": {
        "tags": [
          "health"
        ],
        "summary": "Get Health",
        "operationId": "getHealth",
        "description": "This endpoint is sending health information\n",
        "responses": {
          "200": {
            "$ref": "#/components/responses/HealthResponse"
          },
          "500": {
            "$ref": "#/components/responses/InternalServerErrorResponse"
          },
          "501": {
            "$ref": "#/components/responses/NotImplementedResponse"
          }
        }
      }
    },
    "/admins": {
      "post": {
        "tags": [
          "book-admin"
        ],
        "summary": "Create BookAdmin",
        "operationId": "createBookAdmin",
        "description": "This endpoint creating new book-admin and is sending details of book-admin with assigned ID\n",
        "requestBody": {
          "$ref": "#/components/requestBodies/CreateBookAdminRequest"
        },
        "responses": {
          "201": {
            "$ref": "#/components/responses/CreateBookAdminResponse"
          },
          "default": {
            "$ref": "#/components/responses/DefaultErrorResponse"
          }
        }
      },
      "get": {
        "tags": [
          "book-admin"
        ],
        "summary": "Get BookAdmins",
        "operationId": "getBookAdmins",
        "description": "This endpoint is sending details of all book-admins\n",
        "parameters": [
          {
            "in": "query",
            "name": "skip",
            "description": "how many records to skip",
            "required": false,
            "schema": {
              "type": "integer",
              "format": "int64",
              "minimum": 0,
              "default": 0
            }
          },
          {
            "in": "query",
            "name": "limit",
            "description": "how many records to return",
            "required": false,
            "schema": {
              "type": "integer",
              "format": "int64",
              "minimum": 1,
              "default": 10
            }
          },
          {
            "in": "query",
            "name": "email",
            "description": "filer with email",
            "required": false,
            "schema": {
              "type": "string",
              "default": ""
            }
          }
        ],
        "responses": {
          "200": {
            "$ref": "#/components/responses/BookAdminsResponse"
          },
          "default": {
            "$ref": "#/components/responses/DefaultErrorResponse"
          }
        }
      }
    },
    "/admins/{id}": {
      "get": {
        "tags": [
          "book-admin"
        ],
        "summary": "Get BookAdmin by ID",
        "operationId": "getBookAdminById",
        "description": "This endpoint is sending details of book-admin chosen by ID\n",
        "parameters": [
          {
            "in": "path",
            "name": "id",
            "description": "The ID of an book-admin",
            "required": true,
            "schema": {
              "type": "string"
            }
          }
        ],
        "responses": {
          "200": {
            "$ref": "#/components/responses/BookAdminResponse"
          },
          "404": {
            "$ref": "#/components/responses/NotFoundErrorResponse"
          },
          "default": {
            "$ref": "#/components/responses/DefaultErrorResponse"
          }
        }
      },
      "put": {
        "tags": [
          "book-admin"
        ],
        "summary": "Put BookAdmin by ID",
        "operationId": "putBookAdminById",
        "description": "This endpoint is updating book-admin\n",
        "parameters": [
          {
            "in": "path",
            "name": "id",
            "description": "The ID of an book-admin",
            "required": true,
            "schema": {
              "type": "string"
            }
          }
        ],
        "requestBody": {
          "$ref": "#/components/requestBodies/UpdateBookAdminRequest"
        },
        "responses": {
          "202": {
            "$ref": "#/components/responses/BookAdminResponse"
          },
          "404": {
            "$ref": "#/components/responses/NotFoundErrorResponse"
          },
          "default": {
            "$ref": "#/components/responses/DefaultErrorResponse"
          }
        }
      },
      "delete": {
        "tags": [
          "book-admin"
        ],
        "summary": "Delete BookAdmin by ID",
        "operationId": "deleteBookAdminById",
        "description": "This endpoint is deleting book-admin\n",
        "parameters": [
          {
            "in": "path",
            "name": "id",
            "description": "The ID of an book-admin",
            "required": true,
            "schema": {
              "type": "string"
            }
          }
        ],
        "responses": {
          "202": {
            "$ref": "#/components/responses/SuccessResponse"
          },
          "404": {
            "$ref": "#/components/responses/NotFoundErrorResponse"
          },
          "default": {
            "$ref": "#/components/responses/DefaultErrorResponse"
          }
        }
      }
    }
  },
  "components": {
    "requestBodies": {
      "CreateBookAdminRequest": {
        "description": "Creating book-admin",
        "required": true,
        "content": {
          "application/json": {
            "schema": {
              "$ref": "#/components/schemas/CreateBookAdminInput"
            }
          }
        }
      },
      "UpdateBookAdminRequest": {
        "description": "Updating book-admin",
        "required": true,
        "content": {
          "application/json": {
            "schema": {
              "$ref": "#/components/schemas/UpdateBookAdminInput"
            }
          }
        }
      }
    },
    "responses": {
      "SuccessResponse": {
        "description": "Default Success response",
        "content": {
          "application/json": {
            "schema": {
              "$ref": "#/components/schemas/Success"
            }
          }
        }
      },
      "NotImplementedResponse": {
        "description": "Not Implemented",
        "content": {
          "application/json": {
            "schema": {
              "$ref": "#/components/schemas/Error"
            }
          }
        }
      },
      "InternalServerErrorResponse": {
        "description": "Internal Server Error",
        "content": {
          "application/json": {
            "schema": {
              "$ref": "#/components/schemas/Error"
            }
          }
        }
      },
      "NotFoundErrorResponse": {
        "description": "Not Found",
        "content": {
          "application/json": {
            "schema": {
              "$ref": "#/components/schemas/Error"
            }
          }
        }
      },
      "DefaultErrorResponse": {
        "description": "Unexpected error",
        "content": {
          "application/json": {
            "schema": {
              "$ref": "#/components/schemas/Error"
            }
          }
        }
      },
      "HealthResponse": {
        "description": "Health information",
        "content": {
          "application/json": {
            "schema": {
              "$ref": "#/components/schemas/Health"
            }
          }
        }
      },
      "CreateBookAdminResponse": {
        "description": "Success response for the book-admin creation request",
        "content": {
          "application/json": {
            "schema": {
              "$ref": "#/components/schemas/CreateBookAdminOutput"
            }
          }
        }
      },
      "BookAdminsResponse": {
        "description": "Success response for the book-admins request",
        "content": {
          "application/json": {
            "schema": {
              "$ref": "#/components/schemas/BookAdminsOutput"
            }
          }
        }
      },
      "BookAdminResponse": {
        "description": "Success response for the book-admin request",
        "content": {
          "application/json": {
            "schema": {
              "$ref": "#/components/schemas/BookAdminOutput"
            }
          }
        }
      }
    },
    "schemas": {
      "Success": {
        "type": "object",
        "properties": {
          "status": {
            "type": "integer",
            "default": 200
          },
          "message": {
            "type": "string"
          },
          "content": {
            "type": "object",
            "nullable": true
          }
        }
      },
      "Error": {
        "type": "object",
        "properties": {
          "status": {
            "type": "integer",
            "example": 404
          },
          "message": {
            "type": "string",
            "example": "book-admin not found"
          },
          "errors": {
            "type": "array",
            "items": {
              "type": "string"
            },
            "nullable": true
          }
        }
      },
      "Health": {
        "type": "object",
        "properties": {
          "status": {
            "type": "integer",
            "default": 200
          },
          "message": {
            "type": "string",
            "default": "book admin api health"
          },
          "content": {
            "$ref": "#/components/schemas/HealthContent"
          }
        }
      },
      "HealthContent": {
        "type": "object",
        "properties": {
          "alive": {
            "type": "boolean"
          },
          "mongo": {
            "type": "boolean"
          }
        }
      },
      "CreateBookAdminInput": {
        "type": "object",
        "required": [
          "email",
          "password"
        ],
        "properties": {
          "email": {
            "type": "string",
            "nullable": false
          },
          "firstName": {
            "type": "string",
            "nullable": false
          },
          "lastName": {
            "type": "string",
            "nullable": false
          },
          "password": {
            "type": "string",
            "nullable": false
          },
          "version": {
            "type": "integer",
            "default": 1,
            "nullable": false
          }
        }
      },
      "CreateBookAdminOutput": {
        "type": "object",
        "properties": {
          "status": {
            "type": "integer",
            "default": 201
          },
          "message": {
            "type": "string"
          },
          "content": {
            "$ref": "#/components/schemas/CreatedBookAdmin"
          }
        }
      },
      "CreatedBookAdmin": {
        "type": "object",
        "properties": {
          "id": {
            "type": "string",
            "description": "id of the created object"
          }
        }
      },
      "UpdateBookAdminInput": {
        "type": "object"
      },
      "BookAdminsOutput": {
        "type": "object",
        "required": [
          "status",
          "message",
          "content"
        ],
        "properties": {
          "status": {
            "type": "integer",
            "default": 200
          },
          "message": {
            "type": "string"
          },
          "content": {
            "$ref": "#/components/schemas/PaginatedBookAdminsContent"
          }
        }
      },
      "PaginatedBookAdminsContent": {
        "type": "object",
        "required": [
          "count",
          "skip",
          "limit",
          "results"
        ],
        "properties": {
          "count": {
            "type": "integer",
            "example": 42
          },
          "skip": {
            "type": "integer",
            "example": 0,
            "default": 0
          },
          "limit": {
            "type": "integer",
            "example": 10,
            "default": 10
          },
          "results": {
            "type": "array",
            "items": {
              "$ref": "#/components/schemas/BookAdminObject"
            }
          }
        }
      },
      "BookAdminOutput": {
        "type": "object",
        "required": [
          "status",
          "message",
          "content"
        ],
        "properties": {
          "status": {
            "type": "integer",
            "default": 200
          },
          "message": {
            "type": "string"
          },
          "content": {
            "$ref": "#/components/schemas/BookAdminObject"
          }
        }
      },
      "BookAdminObject": {
        "type": "object",
        "required": [
          "id",
          "email",
          "firstName",
          "lastName",
          "passwordHash",
          "version"
        ],
        "properties": {
          "id": {
            "type": "string",
            "description": "ID of the BookAdmin in the Database",
            "readOnly": true
          },
          "email": {
            "type": "string",
            "nullable": false
          },
          "firstName": {
            "type": "string",
            "nullable": false
          },
          "lastName": {
            "type": "string",
            "nullable": false
          },
          "passwordHash": {
            "type": "string",
            "nullable": false
          },
          "version": {
            "type": "integer",
            "default": 1,
            "nullable": false
          }
        }
      }
    },
    "securitySchemes": {
      "jwtAuth": {
        "type": "http",
        "scheme": "bearer",
        "bearerFormat": "JWT"
      }
    }
  },
  "security": [
    {
      "jwtAuth": []
    }
  ]
}