[gd_scene load_steps=3 format=2]

[ext_resource path="res://sachen/godotszene.png" type="Texture" id=1]

[sub_resource type="RectangleShape2D" id=1]
extents = Vector2( 1210.34, 57.1148 )

[node name="Floor" type="Node2D"]

[node name="Sprite" type="Sprite" parent="."]
scale = Vector2( 3, 1 )
texture = ExtResource( 1 )
region_enabled = true
region_rect = Rect2( 70, 582, 807, 113.5 )

[node name="FloorCollider" type="StaticBody2D" parent="."]

[node name="CollisionShape2D" type="CollisionShape2D" parent="FloorCollider"]
shape = SubResource( 1 )

