[gd_scene load_steps=2 format=2]

[ext_resource path="res://sachen/hats.png" type="Texture" id=1]

[node name="HatB" type="Sprite"]
texture = ExtResource( 1 )
offset = Vector2( 0, -29.84 )
region_enabled = true
region_rect = Rect2( 230, 0, 69.75, 59.75 )

