{
    "postgres_dev": {
        "user": "postgres",
        "pw": "example",
        "db": "quotes",
        "host": "localhost",
        "port": "5432"
    },
    "postgres_docker": {
        "user": "postgres",
        "pw": "example",
        "db": "quotes",
        "host": "db",
        "port": "5432"
    }
}