EESchema Schematic File Version 4
LIBS:upr-cache
EELAYER 30 0
EELAYER END
$Descr A4 11693 8268
encoding utf-8
Sheet 1 2
Title ""
Date ""
Rev ""
Comp ""
Comment1 ""
Comment2 ""
Comment3 ""
Comment4 ""
$EndDescr
$Comp
L bids_symbol:142-0771-831 J1
U 1 1 5D28837F
P 1000 5600
F 0 "J1" H 1078 5825 50  0000 C CNN
F 1 "142-0771-831" H 1078 5734 50  0000 C CNN
F 2 "000_footprint:Rf_SMA_Receptical_SMD_EDGE_142-0771-831" H 1200 5800 60  0001 L CNN
F 3 "" H 1200 5900 60  0001 L CNN
F 4 "142-0771-831" H 1200 6100 60  0001 L CNN "Part Number"
F 5 "Cinch Connectivity Solutions Johnson" H 1200 6700 60  0001 L CNN "Manufacturer"
	1    1000 5600
	1    0    0    -1  
$EndComp
$Comp
L power:GND #PWR0118
U 1 1 5D3889C3
P 1000 5900
F 0 "#PWR0118" H 1000 5650 50  0001 C CNN
F 1 "GND" H 1005 5727 50  0000 C CNN
F 2 "" H 1000 5900 50  0001 C CNN
F 3 "" H 1000 5900 50  0001 C CNN
	1    1000 5900
	1    0    0    -1  
$EndComp
Wire Wire Line
	1000 5800 1000 5900
Text Notes 800  5250 0    208  ~ 0
LO
$Comp
L bids_symbol:Attenuator_GAT-0+ U1
U 1 1 5D72B7EB
P 1900 5650
F 0 "U1" H 2094 5746 50  0000 L CNN
F 1 "PAT0510S-C-0DB-T10" H 1450 5450 50  0000 L CNN
F 2 "000_footprint:RF_Attenuator_Susumu_PAT0510S_with_Transition_Pad" H 1900 5650 50  0001 C CNN
F 3 "" H 1900 5650 50  0001 C CNN
F 4 "Susumu" H 0   0   50  0001 C CNN "Manufacturer"
F 5 "PAT0510S-C-0DB-T10" H 1900 5650 50  0001 C CNN "Part Number"
	1    1900 5650
	1    0    0    -1  
$EndComp
$Comp
L bids_symbol:Attenuator_GAT-0+ U3
U 1 1 5D7316C1
P 4550 5650
F 0 "U3" H 4744 5746 50  0000 L CNN
F 1 "PAT0510S-C-0DB-T10" H 4050 5450 50  0000 L CNN
F 2 "000_footprint:RF_Attenuator_Susumu_PAT0510S_with_Transition_Pad" H 4550 5650 50  0001 C CNN
F 3 "" H 4550 5650 50  0001 C CNN
F 4 "Susumu" H 0   0   50  0001 C CNN "Manufacturer"
F 5 "PAT0510S-C-0DB-T10" H 4550 5650 50  0001 C CNN "Part Number"
	1    4550 5650
	1    0    0    -1  
$EndComp
Wire Wire Line
	2550 5800 2550 6050
Connection ~ 2550 5800
Wire Wire Line
	2600 5800 2550 5800
Wire Wire Line
	2950 6000 2950 6050
Wire Wire Line
	2600 5600 2350 5600
Wire Wire Line
	2550 5700 2550 5800
Connection ~ 2550 5700
Wire Wire Line
	2600 5700 2550 5700
Wire Wire Line
	3350 5800 3350 6050
Wire Wire Line
	3300 5800 3350 5800
Connection ~ 2950 6050
Wire Wire Line
	3350 6050 2950 6050
Wire Wire Line
	3300 5500 3350 5500
Wire Wire Line
	2550 6050 2950 6050
Wire Wire Line
	2550 5500 2550 5700
Wire Wire Line
	2600 5500 2550 5500
Wire Wire Line
	2350 5900 2350 5950
Wire Wire Line
	3500 5100 3500 5600
Connection ~ 3250 4800
Wire Wire Line
	3500 4800 3250 4800
$Comp
L Device:C C1
U 1 1 5D8C62B9
P 2950 4950
F 0 "C1" H 2750 5000 50  0000 L CNN
F 1 "0.01u" H 2650 4900 50  0000 L CNN
F 2 "Capacitor_SMD:C_0402_1005Metric" H 2988 4800 50  0001 C CNN
F 3 "" H 2950 4950 50  0001 C CNN
F 4 "Murata" H 2950 4950 50  0001 C CNN "Manufacturer"
F 5 "GRM155R71E103KA01D" H 2950 4950 50  0001 C CNN "Part Number"
	1    2950 4950
	1    0    0    -1  
$EndComp
$Comp
L Device:C C2
U 1 1 5D8C62C3
P 3250 4950
F 0 "C2" H 3365 4996 50  0000 L CNN
F 1 "10p" H 3365 4905 50  0000 L CNN
F 2 "Capacitor_SMD:C_0402_1005Metric" H 3288 4800 50  0001 C CNN
F 3 "" H 3250 4950 50  0001 C CNN
F 4 "Murata" H 3250 4950 50  0001 C CNN "Manufacturer"
F 5 "GJM1555C1H100JB01D" H 3250 4950 50  0001 C CNN "Part Number"
	1    3250 4950
	1    0    0    -1  
$EndComp
Wire Wire Line
	2950 4800 3250 4800
$Comp
L Device:L L2
U 1 1 5D8C62CE
P 3500 4950
F 0 "L2" H 3552 4996 50  0000 L CNN
F 1 "39n" H 3552 4905 50  0000 L CNN
F 2 "Inductor_SMD:L_0402_1005Metric" H 3500 4950 50  0001 C CNN
F 3 "" H 3500 4950 50  0001 C CNN
F 4 "TE Connectivity Passive Product" H 3500 4950 50  0001 C CNN "Manufacturer"
F 5 "36501E39NJTDG " H 3500 4950 50  0001 C CNN "Part Number"
F 6 "Coilcraft 0402CS-39NXGLW" H 3500 4950 50  0001 C CNN "Bak"
	1    3500 4950
	1    0    0    -1  
$EndComp
$Comp
L power:GND #PWR06
U 1 1 5D8C62E5
P 2950 6050
F 0 "#PWR06" H 2950 5800 50  0001 C CNN
F 1 "GND" H 2955 5877 50  0000 C CNN
F 2 "" H 2950 6050 50  0001 C CNN
F 3 "" H 2950 6050 50  0001 C CNN
	1    2950 6050
	1    0    0    -1  
$EndComp
$Comp
L Device:C C3
U 1 1 5D8C62EF
P 3650 5600
F 0 "C3" V 3398 5600 50  0000 C CNN
F 1 "100p" V 3489 5600 50  0000 C CNN
F 2 "Capacitor_SMD:C_0402_1005Metric" H 3688 5450 50  0001 C CNN
F 3 "" H 3650 5600 50  0001 C CNN
F 4 "Murata" V 3650 5600 50  0001 C CNN "Manufacturer"
F 5 "GRM1555C1H101JA01D" V 3650 5600 50  0001 C CNN "Part Number"
	1    3650 5600
	0    1    1    0   
$EndComp
$Comp
L Device:L L1
U 1 1 5D8C62F9
P 2350 5750
F 0 "L1" H 2402 5796 50  0000 L CNN
F 1 "18n" H 2402 5705 50  0000 L CNN
F 2 "Inductor_SMD:L_0402_1005Metric" H 2350 5750 50  0001 C CNN
F 3 "" H 2350 5750 50  0001 C CNN
F 4 "Murata" H 2350 5750 50  0001 C CNN "Manufacturer"
F 5 "LQG15HS18NJ02D" H 2350 5750 50  0001 C CNN "Part Number"
	1    2350 5750
	1    0    0    -1  
$EndComp
$Comp
L power:GND #PWR05
U 1 1 5D8C6303
P 2350 5950
F 0 "#PWR05" H 2350 5700 50  0001 C CNN
F 1 "GND" H 2355 5777 50  0000 C CNN
F 2 "" H 2350 5950 50  0001 C CNN
F 3 "" H 2350 5950 50  0001 C CNN
	1    2350 5950
	1    0    0    -1  
$EndComp
$Comp
L bids_symbol:Amplifier_CMA-83LN+ U2
U 1 1 5D8C630D
P 2900 5650
F 0 "U2" V 2600 5600 50  0000 C CNN
F 1 "Amplifier_CMA-83LN+" V 3200 5600 50  0000 C CNN
F 2 "000_footprint:Mini-Circuits_DL1721_LandPatternPL-606" H 2950 5550 50  0001 C CNN
F 3 "" H 2950 5550 50  0001 C CNN
F 4 "Mini-Circuits" H 0   0   50  0001 C CNN "Manufacturer"
F 5 "CMA-83LN+" V 2900 5650 50  0001 C CNN "Part Number"
	1    2900 5650
	0    -1   1    0   
$EndComp
$Comp
L power:GND #PWR04
U 1 1 5DABAB4E
P 1850 5300
F 0 "#PWR04" H 1850 5050 50  0001 C CNN
F 1 "GND" H 1850 5150 50  0000 C CNN
F 2 "" H 1850 5300 50  0001 C CNN
F 3 "" H 1850 5300 50  0001 C CNN
	1    1850 5300
	1    0    0    -1  
$EndComp
$Comp
L power:GND #PWR03
U 1 1 5DABBC1D
P 1700 5900
F 0 "#PWR03" H 1700 5650 50  0001 C CNN
F 1 "GND" H 1700 5750 50  0000 C CNN
F 2 "" H 1700 5900 50  0001 C CNN
F 3 "" H 1700 5900 50  0001 C CNN
	1    1700 5900
	1    0    0    -1  
$EndComp
$Comp
L power:GND #PWR010
U 1 1 5DABC830
P 4500 5300
F 0 "#PWR010" H 4500 5050 50  0001 C CNN
F 1 "GND" H 4500 5150 50  0000 C CNN
F 2 "" H 4500 5300 50  0001 C CNN
F 3 "" H 4500 5300 50  0001 C CNN
	1    4500 5300
	1    0    0    -1  
$EndComp
$Comp
L power:GND #PWR09
U 1 1 5DABD070
P 4350 5900
F 0 "#PWR09" H 4350 5650 50  0001 C CNN
F 1 "GND" H 4350 5750 50  0000 C CNN
F 2 "" H 4350 5900 50  0001 C CNN
F 3 "" H 4350 5900 50  0001 C CNN
	1    4350 5900
	1    0    0    -1  
$EndComp
Wire Wire Line
	1200 5600 1400 5600
Wire Wire Line
	1750 5400 1750 5300
Wire Wire Line
	1750 5300 1850 5300
Wire Wire Line
	1700 5800 1700 5900
Wire Wire Line
	2050 5600 2350 5600
Connection ~ 2350 5600
Wire Wire Line
	4350 5800 4350 5900
Wire Wire Line
	4500 5300 4400 5300
Wire Wire Line
	4400 5300 4400 5400
$Comp
L power:GND #PWR02
U 1 1 5DDFA1A2
P 1500 2300
F 0 "#PWR02" H 1500 2050 50  0001 C CNN
F 1 "GND" H 1505 2127 50  0000 C CNN
F 2 "" H 1500 2300 50  0001 C CNN
F 3 "" H 1500 2300 50  0001 C CNN
	1    1500 2300
	1    0    0    -1  
$EndComp
Text Notes 750  2050 0    50   ~ 0
+6.3V
Text Notes 800  2450 0    50   ~ 0
GND
$Sheet
S 1700 4400 750  350 
U 5DF9BF76
F0 "DCDC6V3_6V0_LO" 50
F1 "DCDC6V3_6V0_LP38798.sch" 50
F2 "Vin6V3" I L 1700 4500 50 
F3 "GND" I L 1700 4650 50 
F4 "Vout6V0" O R 2450 4550 50 
$EndSheet
Wire Wire Line
	9900 5800 9900 5900
$Comp
L bids_symbol:142-0771-831 J6
U 1 1 5E194EEF
P 9900 5600
F 0 "J6" H 9978 5825 50  0000 C CNN
F 1 "142-0771-831" H 10050 5750 50  0000 C CNN
F 2 "000_footprint:Rf_SMA_Receptical_SMD_EDGE_142-0771-831" H 10100 5800 60  0001 L CNN
F 3 "" H 10100 5900 60  0001 L CNN
F 4 "142-0771-831" H 10100 6100 60  0001 L CNN "Part Number"
F 5 "Cinch Connectivity Solutions Johnson" H 10100 6700 60  0001 L CNN "Manufacturer"
	1    9900 5600
	-1   0    0    -1  
$EndComp
$Comp
L power:GND #PWR031
U 1 1 5E194EE0
P 9900 5900
F 0 "#PWR031" H 9900 5650 50  0001 C CNN
F 1 "GND" H 9905 5727 50  0000 C CNN
F 2 "" H 9900 5900 50  0001 C CNN
F 3 "" H 9900 5900 50  0001 C CNN
	1    9900 5900
	1    0    0    -1  
$EndComp
Text Notes 9750 5300 0    208  ~ 0
RF
$Comp
L bids_symbol:RF_Shield_S0991-46R S6
U 1 1 5DED5465
P 2100 7050
F 0 "S6" H 2100 7215 50  0000 C CNN
F 1 "RF_Shield_S0991-46R" H 2100 7124 50  0000 C CNN
F 2 "000_footprint:RF_Shielding_Harwin_S0991-46R" H 2000 7150 50  0001 C CNN
F 3 "" H 2000 7150 50  0001 C CNN
F 4 "Harwin" H -1850 -450 50  0001 C CNN "Manufacturer"
F 5 "S0991-46R" H 2100 7050 50  0001 C CNN "Part Number"
	1    2100 7050
	1    0    0    -1  
$EndComp
$Comp
L bids_symbol:RF_Shield_S0991-46R S5
U 1 1 5DED513A
P 1700 7050
F 0 "S5" H 1700 7215 50  0000 C CNN
F 1 "RF_Shield_S0991-46R" H 1700 7124 50  0000 C CNN
F 2 "000_footprint:RF_Shielding_Harwin_S0991-46R" H 1600 7150 50  0001 C CNN
F 3 "" H 1600 7150 50  0001 C CNN
F 4 "Harwin" H -1850 -450 50  0001 C CNN "Manufacturer"
F 5 "S0991-46R" H 1700 7050 50  0001 C CNN "Part Number"
	1    1700 7050
	1    0    0    -1  
$EndComp
$Comp
L bids_symbol:RF_Shield_S0981-46R S3
U 1 1 5DED4A56
P 1100 7050
F 0 "S3" H 1178 7121 50  0000 L CNN
F 1 "RF_Shield_S0981-46R" H 1178 7030 50  0000 L CNN
F 2 "000_footprint:RF_Shielding_Harwin_S0981-46R" H 1000 7150 50  0001 C CNN
F 3 "" H 1000 7150 50  0001 C CNN
F 4 "Harwin" H -1850 -550 50  0001 C CNN "Manufacturer"
F 5 "S0981-46R" H 1100 7050 50  0001 C CNN "Part Number"
	1    1100 7050
	1    0    0    -1  
$EndComp
$Comp
L bids_symbol:RF_Shield_S0981-46R S2
U 1 1 5DED4858
P 850 7050
F 0 "S2" H 928 7121 50  0000 L CNN
F 1 "RF_Shield_S0981-46R" H 928 7030 50  0000 L CNN
F 2 "000_footprint:RF_Shielding_Harwin_S0981-46R" H 750 7150 50  0001 C CNN
F 3 "" H 750 7150 50  0001 C CNN
F 4 "Harwin" H -1850 -550 50  0001 C CNN "Manufacturer"
F 5 "S0981-46R" H 850 7050 50  0001 C CNN "Part Number"
	1    850  7050
	1    0    0    -1  
$EndComp
$Comp
L bids_symbol:RF_Shield_S0981-46R S1
U 1 1 5DED4596
P 600 7050
F 0 "S1" H 678 7121 50  0000 L CNN
F 1 "RF_Shield_S0981-46R" H 678 7030 50  0000 L CNN
F 2 "000_footprint:RF_Shielding_Harwin_S0981-46R" H 500 7150 50  0001 C CNN
F 3 "" H 500 7150 50  0001 C CNN
F 4 "Harwin" H -1850 -550 50  0001 C CNN "Manufacturer"
F 5 "S0981-46R" H 600 7050 50  0001 C CNN "Part Number"
	1    600  7050
	1    0    0    -1  
$EndComp
Wire Wire Line
	5700 4350 5700 5100
Connection ~ 6300 5800
Wire Wire Line
	6300 5900 6300 5800
Wire Wire Line
	6200 5900 6300 5900
Connection ~ 6300 5700
Wire Wire Line
	6300 5800 6300 5700
Wire Wire Line
	6200 5800 6300 5800
Connection ~ 6300 5500
Wire Wire Line
	6300 5700 6300 5500
Wire Wire Line
	6200 5700 6300 5700
Connection ~ 6300 5400
Wire Wire Line
	6300 5500 6300 5400
Wire Wire Line
	6200 5500 6300 5500
Connection ~ 5900 5000
Wire Wire Line
	6300 5000 5900 5000
Wire Wire Line
	6300 5400 6300 5000
Wire Wire Line
	6200 5400 6300 5400
Wire Wire Line
	5900 6300 5800 6300
Connection ~ 5900 6300
Wire Wire Line
	5900 6200 5900 6300
Wire Wire Line
	5800 6300 5700 6300
Connection ~ 5800 6300
Wire Wire Line
	5800 6200 5800 6300
Wire Wire Line
	5700 6300 5600 6300
Connection ~ 5700 6300
Wire Wire Line
	5700 6200 5700 6300
Wire Wire Line
	5600 6300 5500 6300
Connection ~ 5600 6300
Wire Wire Line
	5600 6200 5600 6300
Wire Wire Line
	5500 6300 5400 6300
Connection ~ 5500 6300
Wire Wire Line
	5500 6200 5500 6300
Wire Wire Line
	5400 6300 5000 6300
Connection ~ 5400 6300
Wire Wire Line
	5400 6200 5400 6300
Connection ~ 5000 5900
Wire Wire Line
	5000 6300 5000 5900
Wire Wire Line
	6000 6300 5900 6300
Wire Wire Line
	6000 6200 6000 6300
Connection ~ 5000 5800
Wire Wire Line
	5000 5900 5000 5800
Wire Wire Line
	5100 5900 5000 5900
Connection ~ 5000 5700
Wire Wire Line
	5000 5800 5000 5700
Wire Wire Line
	5100 5800 5000 5800
Connection ~ 5000 5500
Wire Wire Line
	5000 5700 5000 5500
Wire Wire Line
	5100 5700 5000 5700
Connection ~ 5000 5400
Wire Wire Line
	5000 5500 5000 5400
Wire Wire Line
	5100 5500 5000 5500
Wire Wire Line
	5000 5400 5000 5000
Wire Wire Line
	5100 5400 5000 5400
Wire Wire Line
	5400 5000 5000 5000
Connection ~ 5400 5000
Wire Wire Line
	5400 5100 5400 5000
Wire Wire Line
	5800 5000 5400 5000
Connection ~ 5800 5000
Wire Wire Line
	5800 5100 5800 5000
Wire Wire Line
	5900 5000 5800 5000
Wire Wire Line
	5900 5100 5900 5000
$Comp
L power:GND #PWR0116
U 1 1 5D361919
P 5700 6400
F 0 "#PWR0116" H 5700 6150 50  0001 C CNN
F 1 "GND" H 5705 6227 50  0000 C CNN
F 2 "" H 5700 6400 50  0001 C CNN
F 3 "" H 5700 6400 50  0001 C CNN
	1    5700 6400
	1    0    0    -1  
$EndComp
$Comp
L bids_symbol:IQMixer_HMC8193 U6
U 1 1 5D276FBF
P 5650 5650
F 0 "U6" V 5750 5600 50  0000 L CNN
F 1 "IQMixer_HMC8193" V 5650 5350 50  0000 L CNN
F 2 "digikey-footprints:TFQFN-24-1EP_4x4mm" H 5650 5700 50  0001 C CNN
F 3 "" H 5650 5700 50  0001 C CNN
F 4 "Analog Devices" H 0   0   50  0001 C CNN "Manufacturer"
F 5 "HMC8193" V 5650 5650 50  0001 C CNN "Part Number"
	1    5650 5650
	-1   0    0    1   
$EndComp
$Comp
L Mechanical:MountingHole H4
U 1 1 5CF39C94
P 1600 7600
F 0 "H4" H 1700 7646 50  0000 L CNN
F 1 "MountingHole" H 1700 7555 50  0000 L CNN
F 2 "MountingHole:MountingHole_3.2mm_M3" H 1600 7600 50  0001 C CNN
F 3 "" H 1600 7600 50  0001 C CNN
	1    1600 7600
	1    0    0    -1  
$EndComp
$Comp
L Mechanical:MountingHole H3
U 1 1 5CF398A4
P 1300 7600
F 0 "H3" H 1400 7646 50  0000 L CNN
F 1 "MountingHole" H 1400 7555 50  0000 L CNN
F 2 "MountingHole:MountingHole_3.2mm_M3" H 1300 7600 50  0001 C CNN
F 3 "" H 1300 7600 50  0001 C CNN
	1    1300 7600
	1    0    0    -1  
$EndComp
$Comp
L Mechanical:MountingHole H2
U 1 1 5CF395B1
P 1000 7600
F 0 "H2" H 1100 7646 50  0000 L CNN
F 1 "MountingHole" H 1100 7555 50  0000 L CNN
F 2 "MountingHole:MountingHole_3.2mm_M3" H 1000 7600 50  0001 C CNN
F 3 "" H 1000 7600 50  0001 C CNN
	1    1000 7600
	1    0    0    -1  
$EndComp
$Comp
L Mechanical:MountingHole H1
U 1 1 5CF390EE
P 700 7600
F 0 "H1" H 800 7646 50  0000 L CNN
F 1 "MountingHole" H 800 7555 50  0000 L CNN
F 2 "MountingHole:MountingHole_3.2mm_M3" H 700 7600 50  0001 C CNN
F 3 "" H 700 7600 50  0001 C CNN
	1    700  7600
	1    0    0    -1  
$EndComp
Text Notes 700  1200 0    50   ~ 0
-2.0V
Text Notes 800  1100 0    50   ~ 0
GND
Text Notes 700  1000 0    50   ~ 0
+2.0V
Wire Wire Line
	1350 1050 1200 1050
Wire Wire Line
	1200 1250 1550 1250
Wire Wire Line
	1200 1250 1200 1150
Wire Wire Line
	1200 950  1450 950 
$Comp
L dk_Rectangular-Connectors-Headers-Male-Pins:640456-3 J2
U 1 1 5DE81095
P 1100 950
F 0 "J2" V 875 958 50  0000 C CNN
F 1 "0022053031" V 966 958 50  0000 C CNN
F 2 "000_footprint:PinHeader_1x3_P2.54_Drill1.1mm_TE_640456-3" H 1300 1150 60  0001 L CNN
F 3 "" H 1300 1250 60  0001 L CNN
F 4 "0022053031" H 1300 1450 60  0001 L CNN "Part Number"
F 5 "Molex" H 1300 2050 60  0001 L CNN "Manufacturer"
	1    1100 950 
	0    1    1    0   
$EndComp
$Comp
L power:GND #PWR01
U 1 1 5DE81082
P 1350 1050
F 0 "#PWR01" H 1350 800 50  0001 C CNN
F 1 "GND" H 1350 900 50  0000 C CNN
F 2 "" H 1350 1050 50  0001 C CNN
F 3 "" H 1350 1050 50  0001 C CNN
	1    1350 1050
	1    0    0    -1  
$EndComp
$Comp
L Device:R_POT RV2
U 1 1 5D839152
P 1750 1550
F 0 "RV2" H 1681 1596 50  0000 R CNN
F 1 "100k" H 2200 1500 50  0000 R CNN
F 2 "Potentiometer_THT:Potentiometer_Bourns_3266X_Horizontal" H 1750 1550 50  0001 C CNN
F 3 "" H 1750 1550 50  0001 C CNN
F 4 "3266X-1-104LF" H 1750 1550 50  0001 C CNN "Part Number"
F 5 "Bourns Inc." H 1750 1550 50  0001 C CNN "Manufacturer"
	1    1750 1550
	1    0    0    -1  
$EndComp
Wire Wire Line
	5950 2050 5950 1950
Wire Wire Line
	5050 1250 5150 1250
Wire Wire Line
	5050 1350 5050 1250
Wire Wire Line
	5000 1750 5000 1850
$Comp
L power:GND #PWR012
U 1 1 5D36A4E3
P 5150 1250
F 0 "#PWR012" H 5150 1000 50  0001 C CNN
F 1 "GND" H 5155 1077 50  0000 C CNN
F 2 "" H 5150 1250 50  0001 C CNN
F 3 "" H 5150 1250 50  0001 C CNN
	1    5150 1250
	1    0    0    -1  
$EndComp
$Comp
L RF_Filter:LFCN-530D FL1
U 1 1 5D35117B
P 5950 1550
F 0 "FL1" H 6150 1200 50  0000 C CNN
F 1 "LFCN-530D+" H 5950 1926 50  0000 C CNN
F 2 "Filter:Filter_Mini-Circuits_FV1206" H 5950 2050 50  0001 C CNN
F 3 "" H 5950 1550 50  0001 C CNN
F 4 "Mini-Circuits" H 5950 1550 50  0001 C CNN "Manufacturer"
F 5 "LFCN-530D+" H 5950 1550 50  0001 C CNN "Part Number"
	1    5950 1550
	1    0    0    -1  
$EndComp
Text Notes 3750 1700 0    208  ~ 0
IF1
Wire Wire Line
	4300 1750 4300 1850
$Comp
L power:GND #PWR0108
U 1 1 5D2B2D6A
P 4300 1850
F 0 "#PWR0108" H 4300 1600 50  0001 C CNN
F 1 "GND" H 4305 1677 50  0000 C CNN
F 2 "" H 4300 1850 50  0001 C CNN
F 3 "" H 4300 1850 50  0001 C CNN
	1    4300 1850
	1    0    0    -1  
$EndComp
$Comp
L power:GND #PWR0107
U 1 1 5D2B2B1D
P 5950 2050
F 0 "#PWR0107" H 5950 1800 50  0001 C CNN
F 1 "GND" H 5955 1877 50  0000 C CNN
F 2 "" H 5950 2050 50  0001 C CNN
F 3 "" H 5950 2050 50  0001 C CNN
	1    5950 2050
	1    0    0    -1  
$EndComp
$Comp
L power:GND #PWR0106
U 1 1 5D2B21A1
P 5000 1850
F 0 "#PWR0106" H 5000 1600 50  0001 C CNN
F 1 "GND" H 5005 1677 50  0000 C CNN
F 2 "" H 5000 1850 50  0001 C CNN
F 3 "" H 5000 1850 50  0001 C CNN
	1    5000 1850
	1    0    0    -1  
$EndComp
$Comp
L Device:R_POT RV1
U 1 1 5D271B91
P 1750 1100
F 0 "RV1" H 1681 1146 50  0000 R CNN
F 1 "100k" H 2200 1050 50  0000 R CNN
F 2 "Potentiometer_THT:Potentiometer_Bourns_3266X_Horizontal" H 1750 1100 50  0001 C CNN
F 3 "" H 1750 1100 50  0001 C CNN
F 4 "3266X-1-104LF" H 1750 1100 50  0001 C CNN "Part Number"
F 5 "Bourns Inc." H 1750 1100 50  0001 C CNN "Manufacturer"
	1    1750 1100
	1    0    0    -1  
$EndComp
$Comp
L bids_symbol:142-0771-831 J4
U 1 1 5D265B61
P 4300 1550
F 0 "J4" H 4378 1775 50  0000 C CNN
F 1 "142-0771-831" H 4378 1684 50  0000 C CNN
F 2 "000_footprint:Rf_SMA_Receptical_SMD_EDGE_142-0771-831" H 4500 1750 60  0001 L CNN
F 3 "" H 4500 1850 60  0001 L CNN
F 4 "142-0771-831" H 4500 2050 60  0001 L CNN "Part Number"
F 5 "Cinch Connectivity Solutions Johnson" H 4500 2650 60  0001 L CNN "Manufacturer"
	1    4300 1550
	1    0    0    -1  
$EndComp
Wire Wire Line
	2650 4800 2950 4800
$Comp
L dk_Rectangular-Connectors-Headers-Male-Pins:640456-2 J3
U 1 1 5DD13278
P 1100 2200
F 0 "J3" V 875 2208 50  0000 C CNN
F 1 "0022053021" V 1000 2250 50  0000 C CNN
F 2 "000_footprint:PinHeader_1x2_P2.54mm_Drill1.02mm_TE_640456-2" H 1300 2400 60  0001 L CNN
F 3 "" H 1300 2500 60  0001 L CNN
F 4 "0022053021" H 1300 2700 60  0001 L CNN "Part Number"
F 5 "Molex" H 1300 3300 60  0001 L CNN "Manufacturer"
	1    1100 2200
	0    1    1    0   
$EndComp
Wire Wire Line
	1450 950  1450 1400
Wire Wire Line
	1450 1400 1750 1400
Connection ~ 1450 950 
Wire Wire Line
	1450 950  1750 950 
Wire Wire Line
	1550 1250 1550 1700
Wire Wire Line
	1550 1700 1750 1700
Connection ~ 1550 1250
Wire Wire Line
	1550 1250 1750 1250
Wire Wire Line
	1900 1550 3350 1550
Connection ~ 2950 4800
Wire Wire Line
	2450 4550 2650 4550
Wire Wire Line
	2650 4550 2650 4800
Text Label 1500 4500 2    50   ~ 0
Vin6V3
Text Label 1500 4650 2    50   ~ 0
GND
Text Label 1500 2200 0    50   ~ 0
Vin6V3
Text Label 1500 2300 0    50   ~ 0
GND
Wire Wire Line
	1200 2200 1500 2200
Wire Wire Line
	1500 2300 1200 2300
Wire Wire Line
	1500 4500 1700 4500
Wire Wire Line
	1500 4650 1700 4650
Wire Wire Line
	3300 5600 3500 5600
Connection ~ 3500 5600
Wire Wire Line
	3300 5700 3350 5700
Wire Wire Line
	3350 5700 3350 5800
Connection ~ 3350 5800
Wire Wire Line
	3350 5500 3350 5700
Connection ~ 3350 5700
$Comp
L bids_symbol:Attenuator_GAT-0+ U15
U 1 1 5E194EFC
P 9350 5650
F 0 "U15" H 9544 5746 50  0000 L CNN
F 1 "PAT0510S-C-0DB-T10" H 8900 5450 50  0000 L CNN
F 2 "000_footprint:RF_Attenuator_Susumu_PAT0510S_with_Transition_Pad" H 9350 5650 50  0001 C CNN
F 3 "" H 9350 5650 50  0001 C CNN
F 4 "Susumu" H 0   0   50  0001 C CNN "Manufacturer"
F 5 "PAT0510S-C-0DB-T10" H 9350 5650 50  0001 C CNN "Part Number"
	1    9350 5650
	1    0    0    -1  
$EndComp
$Comp
L power:GND #PWR029
U 1 1 5E194F0E
P 9150 5900
F 0 "#PWR029" H 9150 5650 50  0001 C CNN
F 1 "GND" H 9150 5750 50  0000 C CNN
F 2 "" H 9150 5900 50  0001 C CNN
F 3 "" H 9150 5900 50  0001 C CNN
	1    9150 5900
	1    0    0    -1  
$EndComp
$Comp
L power:GND #PWR030
U 1 1 5E194F14
P 9300 5300
F 0 "#PWR030" H 9300 5050 50  0001 C CNN
F 1 "GND" H 9300 5150 50  0000 C CNN
F 2 "" H 9300 5300 50  0001 C CNN
F 3 "" H 9300 5300 50  0001 C CNN
	1    9300 5300
	1    0    0    -1  
$EndComp
Wire Wire Line
	9150 5800 9150 5900
Wire Wire Line
	9200 5400 9200 5300
Wire Wire Line
	9200 5300 9300 5300
Wire Wire Line
	9500 5600 9700 5600
$Comp
L power:GND #PWR0105
U 1 1 5D2AD534
P 8650 1850
F 0 "#PWR0105" H 8650 1600 50  0001 C CNN
F 1 "GND" H 8655 1677 50  0000 C CNN
F 2 "" H 8650 1850 50  0001 C CNN
F 3 "" H 8650 1850 50  0001 C CNN
	1    8650 1850
	1    0    0    -1  
$EndComp
$Comp
L power:GND #PWR027
U 1 1 5D374D14
P 8800 1250
F 0 "#PWR027" H 8800 1000 50  0001 C CNN
F 1 "GND" H 8805 1077 50  0000 C CNN
F 2 "" H 8800 1250 50  0001 C CNN
F 3 "" H 8800 1250 50  0001 C CNN
	1    8800 1250
	1    0    0    -1  
$EndComp
Wire Wire Line
	8700 1350 8700 1250
Wire Wire Line
	8700 1250 8800 1250
Wire Wire Line
	8650 1750 8650 1850
$Comp
L bids_symbol:Attenuator_GAT-10+ U4
U 1 1 5EBBA925
P 5200 1600
F 0 "U4" H 5394 1696 50  0000 L CNN
F 1 "PAT0510S-C-6DB-T10" H 4700 1500 50  0000 L CNN
F 2 "000_footprint:RF_Attenuator_Susumu_PAT0510S_with_Transition_Pad" H 5200 1600 50  0001 C CNN
F 3 "" H 5200 1600 50  0001 C CNN
F 4 "Susumu" H 0   0   50  0001 C CNN "Manufacturer"
F 5 "PAT0510S-C-6DB-T10" H 5200 1600 50  0001 C CNN "Part Number"
	1    5200 1600
	1    0    0    -1  
$EndComp
Wire Wire Line
	4500 1550 4700 1550
Wire Wire Line
	5350 1550 5550 1550
Wire Wire Line
	9000 1550 9250 1550
Wire Wire Line
	6900 1250 7000 1250
Wire Wire Line
	6900 1350 6900 1250
Wire Wire Line
	6850 1750 6850 1850
$Comp
L power:GND #PWR019
U 1 1 5EC4E3DA
P 7000 1250
F 0 "#PWR019" H 7000 1000 50  0001 C CNN
F 1 "GND" H 7005 1077 50  0000 C CNN
F 2 "" H 7000 1250 50  0001 C CNN
F 3 "" H 7000 1250 50  0001 C CNN
	1    7000 1250
	1    0    0    -1  
$EndComp
$Comp
L power:GND #PWR016
U 1 1 5EC4E3E4
P 6850 1850
F 0 "#PWR016" H 6850 1600 50  0001 C CNN
F 1 "GND" H 6855 1677 50  0000 C CNN
F 2 "" H 6850 1850 50  0001 C CNN
F 3 "" H 6850 1850 50  0001 C CNN
	1    6850 1850
	1    0    0    -1  
$EndComp
$Comp
L bids_symbol:Attenuator_GAT-10+ U8
U 1 1 5EC4E3EE
P 7050 1600
F 0 "U8" H 7244 1696 50  0000 L CNN
F 1 "PAT0510S-C-0DB-T10" H 6550 1500 50  0000 L CNN
F 2 "000_footprint:RF_Attenuator_Susumu_PAT0510S_with_Transition_Pad" H 7050 1600 50  0001 C CNN
F 3 "" H 7050 1600 50  0001 C CNN
F 4 "Susumu" H 0   0   50  0001 C CNN "Manufacturer"
F 5 "PAT0510S-C-0DB-T10" H 7050 1600 50  0001 C CNN "Part Number"
	1    7050 1600
	1    0    0    -1  
$EndComp
Wire Wire Line
	6350 1550 6550 1550
Wire Wire Line
	5700 4350 9250 4350
Wire Wire Line
	5950 3850 5950 3750
Wire Wire Line
	5050 3050 5150 3050
Wire Wire Line
	5050 3150 5050 3050
Wire Wire Line
	5000 3550 5000 3650
$Comp
L power:GND #PWR013
U 1 1 5ECB237A
P 5150 3050
F 0 "#PWR013" H 5150 2800 50  0001 C CNN
F 1 "GND" H 5155 2877 50  0000 C CNN
F 2 "" H 5150 3050 50  0001 C CNN
F 3 "" H 5150 3050 50  0001 C CNN
	1    5150 3050
	1    0    0    -1  
$EndComp
$Comp
L RF_Filter:LFCN-530D FL2
U 1 1 5ECB2384
P 5950 3350
F 0 "FL2" H 6150 3000 50  0000 C CNN
F 1 "LFCN-530D+" H 5950 3726 50  0000 C CNN
F 2 "Filter:Filter_Mini-Circuits_FV1206" H 5950 3850 50  0001 C CNN
F 3 "" H 5950 3350 50  0001 C CNN
F 4 "Mini-Circuits" H 5950 3350 50  0001 C CNN "Manufacturer"
F 5 "LFCN-530D+" H 5950 3350 50  0001 C CNN "Part Number"
	1    5950 3350
	1    0    0    -1  
$EndComp
Text Notes 3750 3500 0    208  ~ 0
IF2
Wire Wire Line
	4300 3550 4300 3650
$Comp
L power:GND #PWR08
U 1 1 5ECB23CC
P 4300 3650
F 0 "#PWR08" H 4300 3400 50  0001 C CNN
F 1 "GND" H 4305 3477 50  0000 C CNN
F 2 "" H 4300 3650 50  0001 C CNN
F 3 "" H 4300 3650 50  0001 C CNN
	1    4300 3650
	1    0    0    -1  
$EndComp
$Comp
L power:GND #PWR014
U 1 1 5ECB23D6
P 5950 3850
F 0 "#PWR014" H 5950 3600 50  0001 C CNN
F 1 "GND" H 5955 3677 50  0000 C CNN
F 2 "" H 5950 3850 50  0001 C CNN
F 3 "" H 5950 3850 50  0001 C CNN
	1    5950 3850
	1    0    0    -1  
$EndComp
$Comp
L power:GND #PWR011
U 1 1 5ECB23E0
P 5000 3650
F 0 "#PWR011" H 5000 3400 50  0001 C CNN
F 1 "GND" H 5005 3477 50  0000 C CNN
F 2 "" H 5000 3650 50  0001 C CNN
F 3 "" H 5000 3650 50  0001 C CNN
	1    5000 3650
	1    0    0    -1  
$EndComp
$Comp
L bids_symbol:142-0771-831 J5
U 1 1 5ECB23FD
P 4300 3350
F 0 "J5" H 4378 3575 50  0000 C CNN
F 1 "142-0771-831" H 4378 3484 50  0000 C CNN
F 2 "000_footprint:Rf_SMA_Receptical_SMD_EDGE_142-0771-831" H 4500 3550 60  0001 L CNN
F 3 "" H 4500 3650 60  0001 L CNN
F 4 "142-0771-831" H 4500 3850 60  0001 L CNN "Part Number"
F 5 "Cinch Connectivity Solutions Johnson" H 4500 4450 60  0001 L CNN "Manufacturer"
	1    4300 3350
	1    0    0    -1  
$EndComp
$Comp
L power:GND #PWR026
U 1 1 5ECB2407
P 8650 3650
F 0 "#PWR026" H 8650 3400 50  0001 C CNN
F 1 "GND" H 8655 3477 50  0000 C CNN
F 2 "" H 8650 3650 50  0001 C CNN
F 3 "" H 8650 3650 50  0001 C CNN
	1    8650 3650
	1    0    0    -1  
$EndComp
$Comp
L bids_symbol:Attenuator_GAT-6+ U14
U 1 1 5ECB2411
P 8850 3400
F 0 "U14" H 9044 3496 50  0000 L CNN
F 1 "PAT0510S-C-0DB-T10" H 8350 3300 50  0000 L CNN
F 2 "000_footprint:RF_Attenuator_Susumu_PAT0510S_with_Transition_Pad" H 8850 3400 50  0001 C CNN
F 3 "" H 8850 3400 50  0001 C CNN
F 4 "Susumu" H 0   0   50  0001 C CNN "Manufacturer"
F 5 "PAT0510S-C-0DB-T10" H 8850 3400 50  0001 C CNN "Part Number"
	1    8850 3400
	1    0    0    -1  
$EndComp
$Comp
L power:GND #PWR028
U 1 1 5ECB241B
P 8800 3050
F 0 "#PWR028" H 8800 2800 50  0001 C CNN
F 1 "GND" H 8805 2877 50  0000 C CNN
F 2 "" H 8800 3050 50  0001 C CNN
F 3 "" H 8800 3050 50  0001 C CNN
	1    8800 3050
	1    0    0    -1  
$EndComp
Wire Wire Line
	8700 3150 8700 3050
Wire Wire Line
	8700 3050 8800 3050
Wire Wire Line
	8650 3550 8650 3650
$Comp
L bids_symbol:Attenuator_GAT-10+ U5
U 1 1 5ECB2428
P 5200 3400
F 0 "U5" H 5394 3496 50  0000 L CNN
F 1 "PAT0510S-C-6DB-T10" H 4700 3300 50  0000 L CNN
F 2 "000_footprint:RF_Attenuator_Susumu_PAT0510S_with_Transition_Pad" H 5200 3400 50  0001 C CNN
F 3 "" H 5200 3400 50  0001 C CNN
F 4 "Susumu" H 0   0   50  0001 C CNN "Manufacturer"
F 5 "PAT0510S-C-6DB-T10" H 5200 3400 50  0001 C CNN "Part Number"
	1    5200 3400
	1    0    0    -1  
$EndComp
Wire Wire Line
	4500 3350 4700 3350
Wire Wire Line
	5350 3350 5550 3350
Wire Wire Line
	6900 3050 7000 3050
Wire Wire Line
	6900 3150 6900 3050
Wire Wire Line
	6850 3550 6850 3650
$Comp
L power:GND #PWR020
U 1 1 5ECB243A
P 7000 3050
F 0 "#PWR020" H 7000 2800 50  0001 C CNN
F 1 "GND" H 7005 2877 50  0000 C CNN
F 2 "" H 7000 3050 50  0001 C CNN
F 3 "" H 7000 3050 50  0001 C CNN
	1    7000 3050
	1    0    0    -1  
$EndComp
$Comp
L power:GND #PWR017
U 1 1 5ECB2444
P 6850 3650
F 0 "#PWR017" H 6850 3400 50  0001 C CNN
F 1 "GND" H 6855 3477 50  0000 C CNN
F 2 "" H 6850 3650 50  0001 C CNN
F 3 "" H 6850 3650 50  0001 C CNN
	1    6850 3650
	1    0    0    -1  
$EndComp
$Comp
L bids_symbol:Attenuator_GAT-10+ U9
U 1 1 5ECB244E
P 7050 3400
F 0 "U9" H 7244 3496 50  0000 L CNN
F 1 "PAT0510S-C-0DB-T10" H 6550 3300 50  0000 L CNN
F 2 "000_footprint:RF_Attenuator_Susumu_PAT0510S_with_Transition_Pad" H 7050 3400 50  0001 C CNN
F 3 "" H 7050 3400 50  0001 C CNN
F 4 "Susumu" H 0   0   50  0001 C CNN "Manufacturer"
F 5 "PAT0510S-C-0DB-T10" H 7050 3400 50  0001 C CNN "Part Number"
	1    7050 3400
	1    0    0    -1  
$EndComp
Wire Wire Line
	6350 3350 6550 3350
Wire Wire Line
	3350 1550 3350 2900
Wire Wire Line
	9000 3350 9100 3350
Wire Wire Line
	9100 4250 5500 4250
Wire Wire Line
	5500 4250 5500 5100
Wire Wire Line
	3800 5600 4050 5600
Wire Wire Line
	4700 5600 5100 5600
Wire Wire Line
	5700 6400 5700 6300
$Comp
L bids_symbol:RF_Shield_S0991-46R S8
U 1 1 5D770A5B
P 2900 7050
F 0 "S8" H 2900 7215 50  0000 C CNN
F 1 "RF_Shield_S0991-46R" H 2900 7124 50  0000 C CNN
F 2 "000_footprint:RF_Shielding_Harwin_S0991-46R" H 2800 7150 50  0001 C CNN
F 3 "" H 2800 7150 50  0001 C CNN
F 4 "Harwin" H -1850 -450 50  0001 C CNN "Manufacturer"
F 5 "S0991-46R" H 2900 7050 50  0001 C CNN "Part Number"
	1    2900 7050
	1    0    0    -1  
$EndComp
$Comp
L bids_symbol:RF_Shield_S0991-46R S7
U 1 1 5D770A65
P 2500 7050
F 0 "S7" H 2500 7215 50  0000 C CNN
F 1 "RF_Shield_S0991-46R" H 2500 7124 50  0000 C CNN
F 2 "000_footprint:RF_Shielding_Harwin_S0991-46R" H 2400 7150 50  0001 C CNN
F 3 "" H 2400 7150 50  0001 C CNN
F 4 "Harwin" H -1850 -450 50  0001 C CNN "Manufacturer"
F 5 "S0991-46R" H 2500 7050 50  0001 C CNN "Part Number"
	1    2500 7050
	1    0    0    -1  
$EndComp
$Comp
L bids_symbol:RF_Shield_S0991-46R S10
U 1 1 5D783DA5
P 3700 7050
F 0 "S10" H 3700 7215 50  0000 C CNN
F 1 "RF_Shield_S0991-46R" H 3700 7124 50  0000 C CNN
F 2 "000_footprint:RF_Shielding_Harwin_S0991-46R" H 3600 7150 50  0001 C CNN
F 3 "" H 3600 7150 50  0001 C CNN
F 4 "Harwin" H -1850 -450 50  0001 C CNN "Manufacturer"
F 5 "S0991-46R" H 3700 7050 50  0001 C CNN "Part Number"
	1    3700 7050
	1    0    0    -1  
$EndComp
$Comp
L bids_symbol:RF_Shield_S0991-46R S9
U 1 1 5D783DAF
P 3300 7050
F 0 "S9" H 3300 7215 50  0000 C CNN
F 1 "RF_Shield_S0991-46R" H 3300 7124 50  0000 C CNN
F 2 "000_footprint:RF_Shielding_Harwin_S0991-46R" H 3200 7150 50  0001 C CNN
F 3 "" H 3200 7150 50  0001 C CNN
F 4 "Harwin" H -1850 -450 50  0001 C CNN "Manufacturer"
F 5 "S0991-46R" H 3300 7050 50  0001 C CNN "Part Number"
	1    3300 7050
	1    0    0    -1  
$EndComp
$Comp
L bids_symbol:RF_Shield_S0991-46R S12
U 1 1 5D783DB9
P 4500 7050
F 0 "S12" H 4500 7215 50  0000 C CNN
F 1 "RF_Shield_S0991-46R" H 4500 7124 50  0000 C CNN
F 2 "000_footprint:RF_Shielding_Harwin_S0991-46R" H 4400 7150 50  0001 C CNN
F 3 "" H 4400 7150 50  0001 C CNN
F 4 "Harwin" H -1850 -450 50  0001 C CNN "Manufacturer"
F 5 "S0991-46R" H 4500 7050 50  0001 C CNN "Part Number"
	1    4500 7050
	1    0    0    -1  
$EndComp
$Comp
L bids_symbol:RF_Shield_S0991-46R S11
U 1 1 5D783DC3
P 4100 7050
F 0 "S11" H 4100 7215 50  0000 C CNN
F 1 "RF_Shield_S0991-46R" H 4100 7124 50  0000 C CNN
F 2 "000_footprint:RF_Shielding_Harwin_S0991-46R" H 4000 7150 50  0001 C CNN
F 3 "" H 4000 7150 50  0001 C CNN
F 4 "Harwin" H -1850 -450 50  0001 C CNN "Manufacturer"
F 5 "S0991-46R" H 4100 7050 50  0001 C CNN "Part Number"
	1    4100 7050
	1    0    0    -1  
$EndComp
$Comp
L power:GND #PWR0101
U 1 1 5D7AD367
P 3100 5100
F 0 "#PWR0101" H 3100 4850 50  0001 C CNN
F 1 "GND" H 3105 4927 50  0000 C CNN
F 2 "" H 3100 5100 50  0001 C CNN
F 3 "" H 3100 5100 50  0001 C CNN
	1    3100 5100
	1    0    0    -1  
$EndComp
Wire Wire Line
	3250 5100 3100 5100
Connection ~ 3100 5100
Wire Wire Line
	3100 5100 2950 5100
Wire Wire Line
	8100 1550 8350 1550
Wire Wire Line
	7200 1550 7500 1550
$Comp
L power:GND #PWR023
U 1 1 5D768C0F
P 7800 1850
F 0 "#PWR023" H 7800 1600 50  0001 C CNN
F 1 "GND" H 7805 1677 50  0000 C CNN
F 2 "" H 7800 1850 50  0001 C CNN
F 3 "" H 7800 1850 50  0001 C CNN
	1    7800 1850
	1    0    0    -1  
$EndComp
Wire Wire Line
	7800 1750 7800 1850
$Comp
L bids_symbol:Attenuator_GAT-6+ U13
U 1 1 5D35F659
P 8850 1600
F 0 "U13" H 9044 1696 50  0000 L CNN
F 1 "PAT0510S-C-0DB-T10" H 8350 1500 50  0000 L CNN
F 2 "000_footprint:RF_Attenuator_Susumu_PAT0510S_with_Transition_Pad" H 8850 1600 50  0001 C CNN
F 3 "" H 8850 1600 50  0001 C CNN
F 4 "Susumu" H 0   0   50  0001 C CNN "Manufacturer"
F 5 "PAT0510S-C-0DB-T10" H 8850 1600 50  0001 C CNN "Part Number"
	1    8850 1600
	1    0    0    -1  
$EndComp
Wire Wire Line
	9250 1550 9250 4350
$Comp
L Device:C C13
U 1 1 5D7F3E7F
P 7500 950
F 0 "C13" H 7300 1000 50  0000 L CNN
F 1 "0.01u" H 7200 900 50  0000 L CNN
F 2 "Capacitor_SMD:C_0402_1005Metric" H 7538 800 50  0001 C CNN
F 3 "" H 7500 950 50  0001 C CNN
F 4 "Murata" H 7500 950 50  0001 C CNN "Manufacturer"
F 5 "GRM155R71E103KA01D" H 7500 950 50  0001 C CNN "Part Number"
	1    7500 950 
	1    0    0    -1  
$EndComp
$Comp
L power:GND #PWR07
U 1 1 5D7F9D80
P 7700 800
F 0 "#PWR07" H 7700 550 50  0001 C CNN
F 1 "GND" H 7705 627 50  0000 C CNN
F 2 "" H 7700 800 50  0001 C CNN
F 3 "" H 7700 800 50  0001 C CNN
	1    7700 800 
	1    0    0    -1  
$EndComp
Wire Wire Line
	7500 1100 7500 1350
Wire Wire Line
	7500 800  7700 800 
Wire Wire Line
	7300 1100 7300 1350
Wire Wire Line
	7300 1350 7500 1350
Wire Wire Line
	1900 1100 7300 1100
Wire Wire Line
	9100 3350 9100 4250
Wire Wire Line
	8100 3350 8350 3350
Wire Wire Line
	7200 3350 7500 3350
$Comp
L power:GND #PWR032
U 1 1 5D877781
P 7800 3650
F 0 "#PWR032" H 7800 3400 50  0001 C CNN
F 1 "GND" H 7805 3477 50  0000 C CNN
F 2 "" H 7800 3650 50  0001 C CNN
F 3 "" H 7800 3650 50  0001 C CNN
	1    7800 3650
	1    0    0    -1  
$EndComp
Wire Wire Line
	7800 3550 7800 3650
$Comp
L Device:C C14
U 1 1 5D877798
P 7500 2750
F 0 "C14" H 7300 2800 50  0000 L CNN
F 1 "0.01u" H 7200 2700 50  0000 L CNN
F 2 "Capacitor_SMD:C_0402_1005Metric" H 7538 2600 50  0001 C CNN
F 3 "" H 7500 2750 50  0001 C CNN
F 4 "Murata" H 7500 2750 50  0001 C CNN "Manufacturer"
F 5 "GRM155R71E103KA01D" H 7500 2750 50  0001 C CNN "Part Number"
	1    7500 2750
	1    0    0    -1  
$EndComp
$Comp
L power:GND #PWR022
U 1 1 5D8777A2
P 7700 2600
F 0 "#PWR022" H 7700 2350 50  0001 C CNN
F 1 "GND" H 7705 2427 50  0000 C CNN
F 2 "" H 7700 2600 50  0001 C CNN
F 3 "" H 7700 2600 50  0001 C CNN
	1    7700 2600
	1    0    0    -1  
$EndComp
Wire Wire Line
	7500 2900 7500 3150
Wire Wire Line
	7500 2600 7700 2600
Wire Wire Line
	7300 3150 7500 3150
Wire Wire Line
	7300 2900 3350 2900
Wire Wire Line
	7300 2900 7300 3150
$Comp
L bids_symbol:BiasTee_TCBT-14R+ U10
U 1 1 5D73745D
P 7800 1450
F 0 "U10" H 7800 1815 50  0000 C CNN
F 1 "BiasTee_TCBT-14R+" H 7800 1724 50  0000 C CNN
F 2 "000_footprint:Mini-Circuits_GU1414-2_LandPatternPL-146A" H 7800 1450 50  0001 C CNN
F 3 "" H 7800 1450 50  0001 C CNN
F 4 "Mini-Circuits" H 7800 1450 50  0001 C CNN "Manufacturer"
F 5 "TCBT-14R+" H 7800 1450 50  0001 C CNN "Part Number"
F 6 "TCBT-2R5G+" H 7800 1450 50  0001 C CNN "Bak"
	1    7800 1450
	1    0    0    -1  
$EndComp
Connection ~ 7500 1350
$Comp
L bids_symbol:BiasTee_TCBT-14R+ U11
U 1 1 5D73C849
P 7800 3250
F 0 "U11" H 7800 3615 50  0000 C CNN
F 1 "BiasTee_TCBT-14R+" H 7800 3524 50  0000 C CNN
F 2 "000_footprint:Mini-Circuits_GU1414-2_LandPatternPL-146A" H 7800 3250 50  0001 C CNN
F 3 "" H 7800 3250 50  0001 C CNN
F 4 "Mini-Circuits" H 7800 3250 50  0001 C CNN "Manufacturer"
F 5 "TCBT-14R+" H 7800 3250 50  0001 C CNN "Part Number"
F 6 "TCBT-2R5G+" H 7800 3250 50  0001 C CNN "Bak"
	1    7800 3250
	1    0    0    -1  
$EndComp
Connection ~ 7500 3150
$Comp
L bids_symbol:RF_Shield_S0991-46R S17
U 1 1 5D8A9401
P 4900 7050
F 0 "S17" H 4900 7215 50  0000 C CNN
F 1 "RF_Shield_S0991-46R" H 4900 7124 50  0000 C CNN
F 2 "000_footprint:RF_Shielding_Harwin_S0991-46R" H 4800 7150 50  0001 C CNN
F 3 "" H 4800 7150 50  0001 C CNN
F 4 "Harwin" H 1350 -450 50  0001 C CNN "Manufacturer"
F 5 "S0991-46R" H 4900 7050 50  0001 C CNN "Part Number"
	1    4900 7050
	1    0    0    -1  
$EndComp
$Comp
L bids_symbol:RF_Shield_S0991-46R S18
U 1 1 5D8A96FC
P 5300 7050
F 0 "S18" H 5300 7215 50  0000 C CNN
F 1 "RF_Shield_S0991-46R" H 5300 7124 50  0000 C CNN
F 2 "000_footprint:RF_Shielding_Harwin_S0991-46R" H 5200 7150 50  0001 C CNN
F 3 "" H 5200 7150 50  0001 C CNN
F 4 "Harwin" H 1750 -450 50  0001 C CNN "Manufacturer"
F 5 "S0991-46R" H 5300 7050 50  0001 C CNN "Part Number"
	1    5300 7050
	1    0    0    -1  
$EndComp
$Comp
L bids_symbol:RF_Shield_S0991-46R S19
U 1 1 5D8A993F
P 5700 7050
F 0 "S19" H 5700 7215 50  0000 C CNN
F 1 "RF_Shield_S0991-46R" H 5700 7124 50  0000 C CNN
F 2 "000_footprint:RF_Shielding_Harwin_S0991-46R" H 5600 7150 50  0001 C CNN
F 3 "" H 5600 7150 50  0001 C CNN
F 4 "Harwin" H 2150 -450 50  0001 C CNN "Manufacturer"
F 5 "S0991-46R" H 5700 7050 50  0001 C CNN "Part Number"
	1    5700 7050
	1    0    0    -1  
$EndComp
$Comp
L bids_symbol:RF_Shield_S0991-46R S20
U 1 1 5D8AA103
P 6100 7050
F 0 "S20" H 6100 7215 50  0000 C CNN
F 1 "RF_Shield_S0991-46R" H 6100 7124 50  0000 C CNN
F 2 "000_footprint:RF_Shielding_Harwin_S0991-46R" H 6000 7150 50  0001 C CNN
F 3 "" H 6000 7150 50  0001 C CNN
F 4 "Harwin" H 2550 -450 50  0001 C CNN "Manufacturer"
F 5 "S0991-46R" H 6100 7050 50  0001 C CNN "Part Number"
	1    6100 7050
	1    0    0    -1  
$EndComp
$Comp
L power:GND #PWR0102
U 1 1 5D888415
P 3700 7350
F 0 "#PWR0102" H 3700 7100 50  0001 C CNN
F 1 "GND" H 3705 7177 50  0000 C CNN
F 2 "" H 3700 7350 50  0001 C CNN
F 3 "" H 3700 7350 50  0001 C CNN
	1    3700 7350
	1    0    0    -1  
$EndComp
Wire Wire Line
	600  7200 850  7200
Connection ~ 850  7200
Wire Wire Line
	850  7200 1100 7200
Connection ~ 1100 7200
Wire Wire Line
	1100 7200 1350 7200
Wire Wire Line
	1700 7200 2100 7200
Connection ~ 2100 7200
Wire Wire Line
	2100 7200 2500 7200
Connection ~ 2500 7200
Wire Wire Line
	2500 7200 2900 7200
Connection ~ 2900 7200
Wire Wire Line
	2900 7200 3300 7200
Connection ~ 3300 7200
Wire Wire Line
	3300 7200 3700 7200
Connection ~ 3700 7200
Wire Wire Line
	3700 7200 4100 7200
Connection ~ 4100 7200
Wire Wire Line
	4100 7200 4500 7200
Connection ~ 4500 7200
Wire Wire Line
	4500 7200 4900 7200
Connection ~ 4900 7200
Wire Wire Line
	4900 7200 5300 7200
Connection ~ 5300 7200
Wire Wire Line
	5300 7200 5700 7200
Connection ~ 5700 7200
Wire Wire Line
	5700 7200 6100 7200
Wire Wire Line
	3700 7350 3700 7200
Wire Wire Line
	6200 5600 8850 5600
$Comp
L bids_symbol:RF_Shield_S0981-46R S4
U 1 1 5DA117F4
P 1350 7050
F 0 "S4" H 1428 7121 50  0000 L CNN
F 1 "RF_Shield_S0981-46R" H 1428 7030 50  0000 L CNN
F 2 "000_footprint:RF_Shielding_Harwin_S0981-46R" H 1250 7150 50  0001 C CNN
F 3 "" H 1250 7150 50  0001 C CNN
F 4 "Harwin" H -1600 -550 50  0001 C CNN "Manufacturer"
F 5 "S0981-46R" H 1350 7050 50  0001 C CNN "Part Number"
	1    1350 7050
	1    0    0    -1  
$EndComp
Connection ~ 1350 7200
Wire Wire Line
	1350 7200 1700 7200
Connection ~ 1700 7200
$EndSCHEMATC
