EESchema Schematic File Version 4
LIBS:upr-cache
EELAYER 30 0
EELAYER END
$Descr A4 11693 8268
encoding utf-8
Sheet 2 2
Title ""
Date ""
Rev ""
Comp ""
Comment1 ""
Comment2 ""
Comment3 ""
Comment4 ""
$EndDescr
$Comp
L Device:C C7
U 1 1 5DFA96B1
P 3600 3200
AR Path="/5DF9BF76/5DFA96B1" Ref="C7"  Part="1" 
AR Path="/5E084D55/5DFA96B1" Ref="C?"  Part="1" 
AR Path="/5E182A0A/5DFA96B1" Ref="C?"  Part="1" 
AR Path="/5E194F27/5DFA96B1" Ref="C10"  Part="1" 
F 0 "C7" H 3715 3246 50  0000 L CNN
F 1 "1u" H 3715 3155 50  0000 L CNN
F 2 "Capacitor_SMD:C_0603_1608Metric" H 3638 3050 50  0001 C CNN
F 3 "" H 3600 3200 50  0001 C CNN
F 4 "Kemet" H 3600 3200 50  0001 C CNN "Manufacturer"
F 5 "C0603C105K8PACTU" H 3600 3200 50  0001 C CNN "Part Number"
	1    3600 3200
	1    0    0    -1  
$EndComp
$Comp
L Device:C C8
U 1 1 5DFA96B7
P 3950 3200
AR Path="/5DF9BF76/5DFA96B7" Ref="C8"  Part="1" 
AR Path="/5E084D55/5DFA96B7" Ref="C?"  Part="1" 
AR Path="/5E182A0A/5DFA96B7" Ref="C?"  Part="1" 
AR Path="/5E194F27/5DFA96B7" Ref="C11"  Part="1" 
F 0 "C8" H 4065 3246 50  0000 L CNN
F 1 "10n" H 4065 3155 50  0000 L CNN
F 2 "Capacitor_SMD:C_0201_0603Metric" H 3988 3050 50  0001 C CNN
F 3 "" H 3950 3200 50  0001 C CNN
F 4 "TDK" H 3950 3200 50  0001 C CNN "Manufacturer"
F 5 "CGA1A2X7R1A103K030BA" H 3950 3200 50  0001 C CNN "Part Number"
	1    3950 3200
	1    0    0    -1  
$EndComp
$Comp
L Device:C C9
U 1 1 5DFA96BD
P 5550 3000
AR Path="/5DF9BF76/5DFA96BD" Ref="C9"  Part="1" 
AR Path="/5E084D55/5DFA96BD" Ref="C?"  Part="1" 
AR Path="/5E182A0A/5DFA96BD" Ref="C?"  Part="1" 
AR Path="/5E194F27/5DFA96BD" Ref="C12"  Part="1" 
F 0 "C9" H 5665 3046 50  0000 L CNN
F 1 "1u" H 5665 2955 50  0000 L CNN
F 2 "Capacitor_SMD:C_0603_1608Metric" H 5588 2850 50  0001 C CNN
F 3 "" H 5550 3000 50  0001 C CNN
F 4 "Kemet" H 5550 3000 50  0001 C CNN "Manufacturer"
F 5 "C0603C105K8PACTU" H 5550 3000 50  0001 C CNN "Part Number"
	1    5550 3000
	1    0    0    -1  
$EndComp
$Comp
L Device:R R1
U 1 1 5DFA96C3
P 5150 2900
AR Path="/5DF9BF76/5DFA96C3" Ref="R1"  Part="1" 
AR Path="/5E084D55/5DFA96C3" Ref="R?"  Part="1" 
AR Path="/5E182A0A/5DFA96C3" Ref="R?"  Part="1" 
AR Path="/5E194F27/5DFA96C3" Ref="R3"  Part="1" 
F 0 "R1" H 5220 2946 50  0000 L CNN
F 1 "48.7k" H 5220 2855 50  0000 L CNN
F 2 "Resistor_SMD:R_0201_0603Metric" V 5080 2900 50  0001 C CNN
F 3 "" H 5150 2900 50  0001 C CNN
F 4 "Yageo" H 5150 2900 50  0001 C CNN "Manufacturer"
F 5 "RC0201FR-0748K7L" H 5150 2900 50  0001 C CNN "Part Number"
	1    5150 2900
	1    0    0    -1  
$EndComp
Wire Wire Line
	4200 2700 4100 2700
Wire Wire Line
	4100 2700 4100 2800
Connection ~ 4100 2800
Wire Wire Line
	4100 2800 4200 2800
Wire Wire Line
	4200 2900 4100 2900
Wire Wire Line
	4100 2900 4100 2800
Wire Wire Line
	4500 3400 4500 3500
Wire Wire Line
	3950 3350 3950 3500
Wire Wire Line
	3950 3500 4200 3500
Connection ~ 4500 3500
Wire Wire Line
	4200 3200 4200 3500
Connection ~ 4200 3500
Wire Wire Line
	4200 3500 4500 3500
Wire Wire Line
	3950 3050 3950 3000
Wire Wire Line
	3950 3000 4200 3000
Wire Wire Line
	3600 3350 3600 3500
Wire Wire Line
	3600 3500 3950 3500
Connection ~ 3950 3500
$Comp
L Device:R R2
U 1 1 5DFA96E2
P 5150 3300
AR Path="/5DF9BF76/5DFA96E2" Ref="R2"  Part="1" 
AR Path="/5E084D55/5DFA96E2" Ref="R?"  Part="1" 
AR Path="/5E182A0A/5DFA96E2" Ref="R?"  Part="1" 
AR Path="/5E194F27/5DFA96E2" Ref="R4"  Part="1" 
F 0 "R2" H 5220 3346 50  0000 L CNN
F 1 "12.1k" H 5220 3255 50  0000 L CNN
F 2 "Resistor_SMD:R_0201_0603Metric" V 5080 3300 50  0001 C CNN
F 3 "" H 5150 3300 50  0001 C CNN
F 4 "Yageo" H 5150 3300 50  0001 C CNN "Manufacturer"
F 5 "RC0201FR-0712K1L" H 5150 3300 50  0001 C CNN "Part Number"
	1    5150 3300
	1    0    0    -1  
$EndComp
Connection ~ 4100 2700
Wire Wire Line
	3600 2700 3600 3050
Wire Wire Line
	3600 2700 4100 2700
$Comp
L bids_symbol:LP38798-ADJ U16
U 1 1 5DFA96EB
P 4500 2950
AR Path="/5DF9BF76/5DFA96EB" Ref="U16"  Part="1" 
AR Path="/5E084D55/5DFA96EB" Ref="U?"  Part="1" 
AR Path="/5E182A0A/5DFA96EB" Ref="U?"  Part="1" 
AR Path="/5E194F27/5DFA96EB" Ref="U17"  Part="1" 
F 0 "U16" H 4500 3465 50  0000 C CNN
F 1 "LP38798-ADJ" H 4500 3374 50  0000 C CNN
F 2 "000_footprint:LP38798_WSON-12-1EP_4x4mm_P0.5mm_EP2.6x3mm_ThermalVias" H 4500 2950 50  0001 C CNN
F 3 "" H 4500 2950 50  0001 C CNN
F 4 "Texas Instruments" H 4500 2950 50  0001 C CNN "Manufacturer"
F 5 "LP38798SD-ADJ/NOPB" H 4500 2950 50  0001 C CNN "Part Number"
	1    4500 2950
	1    0    0    -1  
$EndComp
Wire Wire Line
	4800 3100 5150 3100
Wire Wire Line
	5150 3100 5150 3050
Wire Wire Line
	5150 3150 5150 3100
Connection ~ 5150 3100
Wire Wire Line
	5150 3450 5150 3500
Wire Wire Line
	5150 3500 4800 3500
Wire Wire Line
	4800 2700 4900 2700
Wire Wire Line
	5550 2850 5550 2700
Wire Wire Line
	4800 2800 4900 2800
Wire Wire Line
	4900 2800 4900 2700
Connection ~ 4900 2700
Wire Wire Line
	4900 2700 5550 2700
Wire Wire Line
	4800 2900 4900 2900
Wire Wire Line
	4900 2900 4900 2800
Connection ~ 4900 2800
Wire Wire Line
	4800 3000 5000 3000
Wire Wire Line
	5000 3000 5000 2750
Wire Wire Line
	5000 2750 5150 2750
Wire Wire Line
	5550 3150 5550 3500
Wire Wire Line
	5550 3500 5150 3500
Connection ~ 5150 3500
Wire Wire Line
	4800 3200 4800 3500
Connection ~ 4800 3500
Wire Wire Line
	4800 3500 4500 3500
Wire Wire Line
	5550 2700 5850 2700
Connection ~ 5550 2700
Wire Wire Line
	3450 2700 3600 2700
Connection ~ 3600 2700
Text HLabel 3450 2700 0    50   Input ~ 0
Vin6V3
Text HLabel 3400 3500 0    50   Input ~ 0
GND
Text HLabel 5850 2700 2    50   Output ~ 0
Vout6V0
Wire Wire Line
	3600 3500 3400 3500
Connection ~ 3600 3500
$EndSCHEMATC
